BDBM50109510 CHEMBL3601714
SMILES: COc1cc(ccc1Nc1ncc(F)c(NCc2cccc(NC(=O)C=C)c2)n1)N1CCN(C)CC1
InChI Key: InChIKey=ZOXOMNMRLHDZFJ-UHFFFAOYSA-N
Data: 1 IC50
Activity Spreadsheet -- Enzyme Inhibition Constant Data from BindingDB
Found 1 hit for monomerid = 50109510
Trg + Lig
Ki
nM
ΔG°
kcal/mole
IC50
nM
Kd
nM
EC50/IC50
nM
koff
s-1
kon
M-1s-1
pHTemp
°C
Tyrosine-protein kinase JAK3
(Homo sapiens (Human))
BDBM50109510
(CHEMBL3601714)
Show SMILES COc1cc(ccc1Nc1ncc(F)c(NCc2cccc(NC(=O)C=C)c2)n1)N1CCN(C)CC1
Show InChI InChI=1S/C26H30FN7O2/c1-4-24(35)30-19-7-5-6-18(14-19)16-28-25-21(27)17-29-26(32-25)31-22-9-8-20(15-23(22)36-3)34-12-10-33(2)11-13-34/h4-9,14-15,17H,1,10-13,16H2,2-3H3,(H,30,35)(H2,28,29,31,32)
Reactome pathway
n/an/a 30n/an/an/an/an/an/a
Harvard Medical School
Curated by ChEMBL
Assay Description
Inhibition of JAK3 (unknown origin) by Z'-Lyte assay
J Med Chem 58: 6589-606 (2015)
BindingDB Entry DOI: 10.7270/Q2833TSH