BDBM50109578 CHEMBL3604156
SMILES: Fc1ccc(NC(=O)c2n[nH]c(Cl)c2Br)c(Cl)c1
InChI Key: InChIKey=KQQCEIIKSNXSLI-UHFFFAOYSA-N
Data: 2 IC50
Activity Spreadsheet -- Enzyme Inhibition Constant Data from BindingDB
Found 2 hits for monomerid = 50109578
Trg + Lig
Ki
nM
ΔG°
kcal/mole
IC50
nM
Kd
nM
EC50/IC50
nM
koff
s-1
kon
M-1s-1
pHTemp
°C
Arachidonate 15-lipoxygenase
(Homo sapiens (Human))
BDBM50109578
(CHEMBL3604156)
Show SMILES Fc1ccc(NC(=O)c2n[nH]c(Cl)c2Br)c(Cl)c1
Show InChI InChI=1S/C10H5BrCl2FN3O/c11-7-8(16-17-9(7)13)10(18)15-6-2-1-4(14)3-5(6)12/h1-3H,(H,15,18)(H,16,17)
Reactome pathway
n/an/a 10n/an/an/an/an/an/a
Uppsala University
Curated by ChEMBL
Assay Description
Inhibition of 15-LOX-1 in human L1236 cells assessed as reduction in conversion of arachidonic acid to 15-HETE pre-incubated 5 min before arachidonic...
Bioorg Med Chem Lett 25: 3024-9 (2015)
BindingDB Entry DOI: 10.7270/Q2R21350
Arachidonate 15-lipoxygenase
(Homo sapiens (Human))
BDBM50109578
(CHEMBL3604156)
Show SMILES Fc1ccc(NC(=O)c2n[nH]c(Cl)c2Br)c(Cl)c1
Show InChI InChI=1S/C10H5BrCl2FN3O/c11-7-8(16-17-9(7)13)10(18)15-6-2-1-4(14)3-5(6)12/h1-3H,(H,15,18)(H,16,17)
Reactome pathway
n/an/a 1n/an/an/an/an/an/a
Uppsala University
Curated by ChEMBL
Assay Description
Inhibition of human 15-LOX-1 expressed in Sf9 cells assessed as reduction in conversion of arachidonic acid to 15-HETE pre-incubated 5 min before ara...
Bioorg Med Chem Lett 25: 3024-9 (2015)
BindingDB Entry DOI: 10.7270/Q2R21350