BDBM50109615 (3-Hydroxycarbamoyl-3,4-dihydro-1H-isoquinolin-2-yl)-(4-methoxy-phenyl)-phosphinic acid 2-diethylamino-ethyl ester::CHEMBL171292
SMILES: CCN(CC)CCOP(=O)(N1Cc2ccccc2CC1C(=O)NO)c1ccc(OC)cc1
InChI Key: InChIKey=NQUUIXIBNFFYTG-UHFFFAOYSA-N
Data: 4 KI  1 IC50
Activity Spreadsheet -- Enzyme Inhibition Constant Data from BindingDB
Found 5 hits for monomerid = 50109615
Trg + Lig
Ki
nM
ΔG°
kcal/mole
IC50
nM
Kd
nM
EC50/IC50
nM
koff
s-1
kon
M-1s-1
pHTemp
°C
Interstitial collagenase
(Homo sapiens (Human))
BDBM50109615
((3-Hydroxycarbamoyl-3,4-dihydro-1H-isoquinolin-2-y...)
Show SMILES CCN(CC)CCOP(=O)(N1Cc2ccccc2CC1C(=O)NO)c1ccc(OC)cc1
Show InChI InChI=1S/C23H32N3O5P/c1-4-25(5-2)14-15-31-32(29,21-12-10-20(30-3)11-13-21)26-17-19-9-7-6-8-18(19)16-22(26)23(27)24-28/h6-13,22,28H,4-5,14-17H2,1-3H3,(H,24,27)
Reactome pathway
10.7n/an/an/an/an/an/an/an/a
Nippon Organon K.K.
Curated by ChEMBL
Assay Description
Inhibitory activity against matrix metalloprotease-1 (MMP-1)(recombinant human collagenase-1).
J Med Chem 45: 919-29 (2002)
BindingDB Entry DOI: 10.7270/Q2XK8G9Q
Matrix metalloproteinase-9
(Homo sapiens (Human))
BDBM50109615
((3-Hydroxycarbamoyl-3,4-dihydro-1H-isoquinolin-2-y...)
Show SMILES CCN(CC)CCOP(=O)(N1Cc2ccccc2CC1C(=O)NO)c1ccc(OC)cc1
Show InChI InChI=1S/C23H32N3O5P/c1-4-25(5-2)14-15-31-32(29,21-12-10-20(30-3)11-13-21)26-17-19-9-7-6-8-18(19)16-22(26)23(27)24-28/h6-13,22,28H,4-5,14-17H2,1-3H3,(H,24,27)
Reactome pathway
16.7n/an/an/an/an/an/an/an/a
Nippon Organon K.K.
Curated by ChEMBL
Assay Description
Inhibitory activity against matrix metalloprotease-9 (MMP-9)(gelatinase-B).
J Med Chem 45: 919-29 (2002)
BindingDB Entry DOI: 10.7270/Q2XK8G9Q
Disintegrin and metalloproteinase domain-containing protein 17
(Homo sapiens (Human))
BDBM50109615
((3-Hydroxycarbamoyl-3,4-dihydro-1H-isoquinolin-2-y...)
Show SMILES CCN(CC)CCOP(=O)(N1Cc2ccccc2CC1C(=O)NO)c1ccc(OC)cc1
Show InChI InChI=1S/C23H32N3O5P/c1-4-25(5-2)14-15-31-32(29,21-12-10-20(30-3)11-13-21)26-17-19-9-7-6-8-18(19)16-22(26)23(27)24-28/h6-13,22,28H,4-5,14-17H2,1-3H3,(H,24,27)
Reactome pathway
33.2n/an/an/an/an/an/an/an/a
Nippon Organon K.K.
Curated by ChEMBL
Assay Description
Inhibitory activity against tumor necrosis factor alpha converting enzyme (TACE) from human acute monocytic leukemia cell line.
J Med Chem 45: 919-29 (2002)
BindingDB Entry DOI: 10.7270/Q2XK8G9Q
Stromelysin-1
(Homo sapiens (Human))
BDBM50109615
((3-Hydroxycarbamoyl-3,4-dihydro-1H-isoquinolin-2-y...)
Show SMILES CCN(CC)CCOP(=O)(N1Cc2ccccc2CC1C(=O)NO)c1ccc(OC)cc1
Show InChI InChI=1S/C23H32N3O5P/c1-4-25(5-2)14-15-31-32(29,21-12-10-20(30-3)11-13-21)26-17-19-9-7-6-8-18(19)16-22(26)23(27)24-28/h6-13,22,28H,4-5,14-17H2,1-3H3,(H,24,27)
Reactome pathway
82.4n/an/an/an/an/an/an/an/a
Nippon Organon K.K.
Curated by ChEMBL
Assay Description
Inhibitory activity against matrix metalloprotease-3 (MMP-3)(stromelysin-1).
J Med Chem 45: 919-29 (2002)
BindingDB Entry DOI: 10.7270/Q2XK8G9Q
Disintegrin and metalloproteinase domain-containing protein 9 (ADAM9)
(Homo sapiens (Human))
BDBM50109615
((3-Hydroxycarbamoyl-3,4-dihydro-1H-isoquinolin-2-y...)
Show SMILES CCN(CC)CCOP(=O)(N1Cc2ccccc2CC1C(=O)NO)c1ccc(OC)cc1
Show InChI InChI=1S/C23H32N3O5P/c1-4-25(5-2)14-15-31-32(29,21-12-10-20(30-3)11-13-21)26-17-19-9-7-6-8-18(19)16-22(26)23(27)24-28/h6-13,22,28H,4-5,14-17H2,1-3H3,(H,24,27)
n/an/a 1.14E+3n/an/an/an/an/an/a
Nippon Organon K.K.
Curated by ChEMBL
Assay Description
Inhibition of the heparin binding epidermal growth factor (HB-EGF) release from fibrosarcoma HT1080 transfectants expressing alkaline phosphate (AP) ...
J Med Chem 45: 919-29 (2002)
BindingDB Entry DOI: 10.7270/Q2XK8G9Q