null
SMILES: CCOP(=O)(N1Cc2ccccc2CC1C(=O)NO)c1ccc(F)cc1
InChI Key: InChIKey=NQYWUYPYYFALAI-UHFFFAOYSA-N
Activity Spreadsheet -- Enzyme Inhibition Constant Data from BindingDB
Found 4 hits for monomerid = 50109629
Trg + Lig
Ki
nM
ΔG°
kcal/mole
IC50
nM
Kd
nM
EC50/IC50
nM
koff
s-1
kon
M-1s-1
pHTemp
°C
Stromelysin-1
(Homo sapiens (Human))
BDBM50109629
((4-Fluoro-phenyl)-(3-hydroxycarbamoyl-3,4-dihydro-...)
Show SMILES CCOP(=O)(N1Cc2ccccc2CC1C(=O)NO)c1ccc(F)cc1
Show InChI InChI=1S/C18H20FN2O4P/c1-2-25-26(24,16-9-7-15(19)8-10-16)21-12-14-6-4-3-5-13(14)11-17(21)18(22)20-23/h3-10,17,23H,2,11-12H2,1H3,(H,20,22)
Reactome pathway
64.4n/an/an/an/an/an/an/an/a
Nippon Organon K.K.
Curated by ChEMBL
Assay Description
Inhibitory activity against matrix metalloprotease-3 (MMP-3)(stromelysin-1).
J Med Chem 45: 919-29 (2002)
BindingDB Entry DOI: 10.7270/Q2XK8G9Q
Interstitial collagenase
(Homo sapiens (Human))
BDBM50109629
((4-Fluoro-phenyl)-(3-hydroxycarbamoyl-3,4-dihydro-...)
Show SMILES CCOP(=O)(N1Cc2ccccc2CC1C(=O)NO)c1ccc(F)cc1
Show InChI InChI=1S/C18H20FN2O4P/c1-2-25-26(24,16-9-7-15(19)8-10-16)21-12-14-6-4-3-5-13(14)11-17(21)18(22)20-23/h3-10,17,23H,2,11-12H2,1H3,(H,20,22)
Reactome pathway
0.970n/an/an/an/an/an/an/an/a
Nippon Organon K.K.
Curated by ChEMBL
Assay Description
Inhibitory activity against matrix metalloprotease-1 (MMP-1)(recombinant human collagenase-1).
J Med Chem 45: 919-29 (2002)
BindingDB Entry DOI: 10.7270/Q2XK8G9Q
Disintegrin and metalloproteinase domain-containing protein 9
(Homo sapiens (Human))
BDBM50109629
((4-Fluoro-phenyl)-(3-hydroxycarbamoyl-3,4-dihydro-...)
Show SMILES CCOP(=O)(N1Cc2ccccc2CC1C(=O)NO)c1ccc(F)cc1
Show InChI InChI=1S/C18H20FN2O4P/c1-2-25-26(24,16-9-7-15(19)8-10-16)21-12-14-6-4-3-5-13(14)11-17(21)18(22)20-23/h3-10,17,23H,2,11-12H2,1H3,(H,20,22)
n/an/a 300n/an/an/an/an/an/a
Nippon Organon K.K.
Curated by ChEMBL
Assay Description
Inhibition of the heparin binding epidermal growth factor (HB-EGF) release from fibrosarcoma HT1080 transfectants expressing alkaline phosphate (AP) ...
J Med Chem 45: 919-29 (2002)
BindingDB Entry DOI: 10.7270/Q2XK8G9Q
Matrix metalloproteinase-9
(Homo sapiens (Human))
BDBM50109629
((4-Fluoro-phenyl)-(3-hydroxycarbamoyl-3,4-dihydro-...)
Show SMILES CCOP(=O)(N1Cc2ccccc2CC1C(=O)NO)c1ccc(F)cc1
Show InChI InChI=1S/C18H20FN2O4P/c1-2-25-26(24,16-9-7-15(19)8-10-16)21-12-14-6-4-3-5-13(14)11-17(21)18(22)20-23/h3-10,17,23H,2,11-12H2,1H3,(H,20,22)
Reactome pathway
51.9n/an/an/an/an/an/an/an/a
Nippon Organon K.K.
Curated by ChEMBL
Assay Description
Inhibitory activity against matrix metalloprotease-9 (MMP-9)(gelatinase-B).
J Med Chem 45: 919-29 (2002)
BindingDB Entry DOI: 10.7270/Q2XK8G9Q