BDBM50109690 3,4,5-Trihydroxy-benzoic acid 2-(4-hydroxy-phenyl)-ethyl ester::4-hydroxyphenethyl 3,4,5-trihydroxybenzoate::CHEMBL147069
SMILES: Oc1ccc(CCOC(=O)c2cc(O)c(O)c(O)c2)cc1
InChI Key: InChIKey=WSPSAXWXELZFQI-UHFFFAOYSA-N
Data: 3 IC50
Activity Spreadsheet -- Enzyme Inhibition Constant Data from BindingDB
Found 3 hits for monomerid = 50109690
Trg + Lig
Ki
nM
ΔG°
kcal/mole
IC50
nM
Kd
nM
EC50/IC50
nM
koff
s-1
kon
M-1s-1
pHTemp
°C
Human immunodeficiency virus type 1 reverse transcriptase
(Human immunodeficiency virus 1)
BDBM50109690
(3,4,5-Trihydroxy-benzoic acid 2-(4-hydroxy-phenyl)...)
Show SMILES Oc1ccc(CCOC(=O)c2cc(O)c(O)c(O)c2)cc1
Show InChI InChI=1S/C15H14O6/c16-11-3-1-9(2-4-11)5-6-21-15(20)10-7-12(17)14(19)13(18)8-10/h1-4,7-8,16-19H,5-6H2
n/an/a 4.50E+3n/an/an/an/an/an/a
University of Toledo
Curated by ChEMBL
Assay Description
Tested for its ability to inhibit HIV-1 reverse transcriptase strand transfer using wild type HIV-1-RT enzyme
Bioorg Med Chem Lett 12: 525-8 (2002)
BindingDB Entry DOI: 10.7270/Q26W99DZ
Tyrosinase
(Homo sapiens (Human))
BDBM50109690
(3,4,5-Trihydroxy-benzoic acid 2-(4-hydroxy-phenyl)...)
Show SMILES Oc1ccc(CCOC(=O)c2cc(O)c(O)c(O)c2)cc1
Show InChI InChI=1S/C15H14O6/c16-11-3-1-9(2-4-11)5-6-21-15(20)10-7-12(17)14(19)13(18)8-10/h1-4,7-8,16-19H,5-6H2
n/an/a 4.93E+3n/an/an/an/an/an/a
AmorePacific Corporation
Curated by ChEMBL
Assay Description
Inhibition of tyrosinase in Melan-a cells
Bioorg Med Chem Lett 17: 5462-4 (2007)
Article DOI: 10.1016/j.bmcl.2007.07.032
BindingDB Entry DOI: 10.7270/Q2BZ65RK
Human immunodeficiency virus type 1 reverse transcriptase
(Human immunodeficiency virus 1)
BDBM50109690
(3,4,5-Trihydroxy-benzoic acid 2-(4-hydroxy-phenyl)...)
Show SMILES Oc1ccc(CCOC(=O)c2cc(O)c(O)c(O)c2)cc1
Show InChI InChI=1S/C15H14O6/c16-11-3-1-9(2-4-11)5-6-21-15(20)10-7-12(17)14(19)13(18)8-10/h1-4,7-8,16-19H,5-6H2
n/an/a 7.90E+3n/an/an/an/an/an/a
University of Toledo
Curated by ChEMBL
Assay Description
Tested for its ability to inhibit HIV-1 reverse transcriptase strand transfer using A17 double mutant HIV-1-RT enzyme
Bioorg Med Chem Lett 12: 525-8 (2002)
BindingDB Entry DOI: 10.7270/Q26W99DZ