BDBM50109750 2-Dibutylamino-1-{2,7-dichloro-9-[1-(4-chloro-phenyl)-meth-(E)-ylidene]-9H-fluoren-4-yl}-ethanol::CHEMBL422330::LUMEFANTRINE
SMILES: CCCCN(CCCC)CC(O)c1cc(Cl)cc2\C(=C\c3ccc(Cl)cc3)c3cc(Cl)ccc3-c12
InChI Key: InChIKey=DYLGFOYVTXJFJP-MFKUBSTISA-N
Data: 2 IC50
Activity Spreadsheet -- Enzyme Inhibition Constant Data from BindingDB
Found 2 hits for monomerid = 50109750
Trg + Lig
Ki
nM
ΔG°
kcal/mole
IC50
nM
Kd
nM
EC50/IC50
nM
koff
s-1
kon
M-1s-1
pHTemp
°C
Potassium voltage-gated channel subfamily H member 2
(Homo sapiens (Human))
BDBM50109750
(2-Dibutylamino-1-{2,7-dichloro-9-[1-(4-chloro-phen...)
Show SMILES CCCCN(CCCC)CC(O)c1cc(Cl)cc2\C(=C\c3ccc(Cl)cc3)c3cc(Cl)ccc3-c12
Show InChI InChI=1S/C30H32Cl3NO/c1-3-5-13-34(14-6-4-2)19-29(35)28-18-23(33)17-27-25(15-20-7-9-21(31)10-8-20)26-16-22(32)11-12-24(26)30(27)28/h7-12,15-18,29,35H,3-6,13-14,19H2,1-2H3/b25-15+
Reactome pathway
n/an/a 8.10E+3n/an/an/an/an/an/a
China Pharmaceutical University
Curated by ChEMBL
Assay Description
Inhibitory concentration against IKr potassium channel
Bioorg Med Chem Lett 14: 4771-7 (2004)
Article DOI: 10.1016/j.bmcl.2004.06.070
BindingDB Entry DOI: 10.7270/Q208661K
Potassium voltage-gated channel subfamily H member 2
(Homo sapiens (Human))
BDBM50109750
(2-Dibutylamino-1-{2,7-dichloro-9-[1-(4-chloro-phen...)
Show SMILES CCCCN(CCCC)CC(O)c1cc(Cl)cc2\C(=C\c3ccc(Cl)cc3)c3cc(Cl)ccc3-c12
Show InChI InChI=1S/C30H32Cl3NO/c1-3-5-13-34(14-6-4-2)19-29(35)28-18-23(33)17-27-25(15-20-7-9-21(31)10-8-20)26-16-22(32)11-12-24(26)30(27)28/h7-12,15-18,29,35H,3-6,13-14,19H2,1-2H3/b25-15+
Reactome pathway
n/an/a 8.13E+3n/an/an/an/an/an/a
TCG Lifesciences Ltd.
Curated by ChEMBL
Assay Description
Inhibition of human ERG
Eur J Med Chem 46: 618-30 (2011)
Article DOI: 10.1016/j.ejmech.2010.11.042
BindingDB Entry DOI: 10.7270/Q2WQ052W