BDBM50109806 3-[2-(6,7-Dimethoxy-3,4-dihydro-1H-isoquinolin-2-yl)-ethyl]-2-(4-dimethylamino-phenyl)-7-nitro-3H-quinazolin-4-one::CHEMBL264490
SMILES: COc1cc2CCN(CCn3c(nc4cc(ccc4c3=O)[N+]([O-])=O)-c3ccc(cc3)N(C)C)Cc2cc1OC
InChI Key: InChIKey=GVALHBYTVPPPRH-UHFFFAOYSA-N
Data: 2 IC50
Activity Spreadsheet -- Enzyme Inhibition Constant Data from BindingDB
Found 2 hits for monomerid = 50109806
Trg + Lig
Ki
nM
ΔG°
kcal/mole
IC50
nM
Kd
nM
EC50/IC50
nM
koff
s-1
kon
M-1s-1
pHTemp
°C
ATP-dependent translocase ABCB1
(Mus musculus)
BDBM50109806
(3-[2-(6,7-Dimethoxy-3,4-dihydro-1H-isoquinolin-2-y...)
Show SMILES COc1cc2CCN(CCn3c(nc4cc(ccc4c3=O)[N+]([O-])=O)-c3ccc(cc3)N(C)C)Cc2cc1OC
Show InChI InChI=1S/C29H31N5O5/c1-31(2)22-7-5-19(6-8-22)28-30-25-17-23(34(36)37)9-10-24(25)29(35)33(28)14-13-32-12-11-20-15-26(38-3)27(39-4)16-21(20)18-32/h5-10,15-17H,11-14,18H2,1-4H3
Reactome pathway
n/an/a 1.10E+3n/an/an/an/an/an/a
Xenova Ltd.
Curated by ChEMBL
Assay Description
Inhibitory activity against P-glyco-protein (Pgp) using accumulation assay for Pgp expressing EMT6/AR1.0 cells.
Bioorg Med Chem Lett 12: 571-4 (2002)
BindingDB Entry DOI: 10.7270/Q2PV6JP9
Multidrug resistance-associated protein 1
(Homo sapiens (Human))
BDBM50109806
(3-[2-(6,7-Dimethoxy-3,4-dihydro-1H-isoquinolin-2-y...)
Show SMILES COc1cc2CCN(CCn3c(nc4cc(ccc4c3=O)[N+]([O-])=O)-c3ccc(cc3)N(C)C)Cc2cc1OC
Show InChI InChI=1S/C29H31N5O5/c1-31(2)22-7-5-19(6-8-22)28-30-25-17-23(34(36)37)9-10-24(25)29(35)33(28)14-13-32-12-11-20-15-26(38-3)27(39-4)16-21(20)18-32/h5-10,15-17H,11-14,18H2,1-4H3
n/an/a 2.02E+3n/an/an/an/an/an/a
Xenova Ltd.
Curated by ChEMBL
Assay Description
Inhibition of multidrug resistance associated protein type 1 (MRP1) assayed by an accumulation assay in COR.L23/R cells
Bioorg Med Chem Lett 12: 571-4 (2002)
BindingDB Entry DOI: 10.7270/Q2PV6JP9