BDBM50109827 CHEMBL411326
SMILES: Fc1ccc2c3nc([nH]c3c3cc[nH]c(=O)c3c2c1)-c1ccccc1C(F)(F)F
InChI Key: InChIKey=MAMAXAVBDDWYKF-UHFFFAOYSA-N
Data: 1 IC50
Activity Spreadsheet -- Enzyme Inhibition Constant Data from BindingDB
Found 1 hit for monomerid = 50109827
Trg + Lig
Ki
nM
ΔG°
kcal/mole
IC50
nM
Kd
nM
EC50/IC50
nM
koff
s-1
kon
M-1s-1
pHTemp
°C
Prostaglandin E synthase
(Homo sapiens (Human))
BDBM50109827
(CHEMBL411326)
Show SMILES Fc1ccc2c3nc([nH]c3c3cc[nH]c(=O)c3c2c1)-c1ccccc1C(F)(F)F
Show InChI InChI=1S/C21H11F4N3O/c22-10-5-6-11-14(9-10)16-13(7-8-26-20(16)29)18-17(11)27-19(28-18)12-3-1-2-4-15(12)21(23,24)25/h1-9H,(H,26,29)(H,27,28)
Reactome pathway
n/an/a 560n/an/an/an/an/an/a
University of Innsbruck
Curated by ChEMBL
Assay Description
Inhibition of mPGES-1 in IL-1beta-stimulated human A549 cell microsomal membranes assessed as reduction in PGE2 formation incubated for 15 mins using...
Bioorg Med Chem 23: 4839-45 (2015)
BindingDB Entry DOI: 10.7270/Q2M90BF8