BDBM50109964 (S)-2-{[(S)-1-(3,5-Dichloro-benzenesulfonyl)-pyrrolidine-2-carbonyl]-amino}-3-thiazol-4-yl-propionic acid::CHEMBL351756
SMILES: OC(=O)[C@H](Cc1cscn1)NC(=O)[C@@H]1CCCN1S(=O)(=O)c1cc(Cl)cc(Cl)c1
InChI Key: InChIKey=XTGPAZFJJAYMMR-GJZGRUSLSA-N
Data: 2 IC50
Activity Spreadsheet -- Enzyme Inhibition Constant Data from BindingDB
Found 2 hits for monomerid = 50109964
Trg + Lig
Ki
nM
ΔG°
kcal/mole
IC50
nM
Kd
nM
EC50/IC50
nM
koff
s-1
kon
M-1s-1
pHTemp
°C
Integrin α4β7
(Homo sapiens (Human))
BDBM50109964
((S)-2-{[(S)-1-(3,5-Dichloro-benzenesulfonyl)-pyrro...)
Show SMILES OC(=O)[C@H](Cc1cscn1)NC(=O)[C@@H]1CCCN1S(=O)(=O)c1cc(Cl)cc(Cl)c1
Show InChI InChI=1S/C17H17Cl2N3O5S2/c18-10-4-11(19)6-13(5-10)29(26,27)22-3-1-2-15(22)16(23)21-14(17(24)25)7-12-8-28-9-20-12/h4-6,8-9,14-15H,1-3,7H2,(H,21,23)(H,24,25)/t14-,15-/m0/s1
NCI pathway
Reactome pathway
n/an/a 2.35E+3n/an/an/an/an/an/a
Merck Research Laboratories
Curated by ChEMBL
Assay Description
Inhibition of MadCAM-Ig binding to alpha-4 beta-7 integrin
Bioorg Med Chem Lett 12: 637-40 (2002)
BindingDB Entry DOI: 10.7270/Q2XD110X
Fibronectin receptor beta/Integrin alpha-4
(Homo sapiens (Human))
BDBM50109964
((S)-2-{[(S)-1-(3,5-Dichloro-benzenesulfonyl)-pyrro...)
Show SMILES OC(=O)[C@H](Cc1cscn1)NC(=O)[C@@H]1CCCN1S(=O)(=O)c1cc(Cl)cc(Cl)c1
Show InChI InChI=1S/C17H17Cl2N3O5S2/c18-10-4-11(19)6-13(5-10)29(26,27)22-3-1-2-15(22)16(23)21-14(17(24)25)7-12-8-28-9-20-12/h4-6,8-9,14-15H,1-3,7H2,(H,21,23)(H,24,25)/t14-,15-/m0/s1
Reactome pathway
n/an/a 0.730n/an/an/an/an/an/a
Merck Research Laboratories
Curated by ChEMBL
Assay Description
Inhibitory activity against very late antigen-4 (VLA-4) using VCAM-Ig ligand.
Bioorg Med Chem Lett 12: 637-40 (2002)
BindingDB Entry DOI: 10.7270/Q2XD110X