BDBM50109975 (S)-2-{[(R)-1-(3,5-Dichloro-benzenesulfonyl)-2-methyl-pyrrolidine-2-carbonyl]-amino}-3-phenyl-propionic acid::CHEMBL433694
SMILES: C[C@@]1(CCCN1S(=O)(=O)c1cc(Cl)cc(Cl)c1)C(=O)N[C@@H](Cc1ccccc1)C(O)=O
InChI Key: InChIKey=FZHRZAHVVNSORE-GHTZIAJQSA-N
Data: 1 IC50
Activity Spreadsheet -- Enzyme Inhibition Constant Data from BindingDB
Found 1 hit for monomerid = 50109975
Trg + Lig
Ki
nM
ΔG°
kcal/mole
IC50
nM
Kd
nM
EC50/IC50
nM
koff
s-1
kon
M-1s-1
pHTemp
°C
Fibronectin receptor beta/Integrin alpha-4
(Homo sapiens (Human))
BDBM50109975
((S)-2-{[(R)-1-(3,5-Dichloro-benzenesulfonyl)-2-met...)
Show SMILES C[C@@]1(CCCN1S(=O)(=O)c1cc(Cl)cc(Cl)c1)C(=O)N[C@@H](Cc1ccccc1)C(O)=O
Show InChI InChI=1S/C21H22Cl2N2O5S/c1-21(20(28)24-18(19(26)27)10-14-6-3-2-4-7-14)8-5-9-25(21)31(29,30)17-12-15(22)11-16(23)13-17/h2-4,6-7,11-13,18H,5,8-10H2,1H3,(H,24,28)(H,26,27)/t18-,21+/m0/s1
Reactome pathway
n/an/a 2.06E+3n/an/an/an/an/an/a
Merck Research Laboratories
Curated by ChEMBL
Assay Description
Inhibitory activity against very late antigen-4 (VLA-4) using VCAM-Ig ligand.
Bioorg Med Chem Lett 12: 637-40 (2002)
BindingDB Entry DOI: 10.7270/Q2XD110X