BDBM50109976 (S)-2-{[(S)-1-(3,5-Dichloro-benzenesulfonyl)-2-methyl-pyrrolidine-2-carbonyl]-amino}-3-(4-fluoro-phenyl)-propionic acid::CHEMBL158726
SMILES: C[C@]1(CCCN1S(=O)(=O)c1cc(Cl)cc(Cl)c1)C(=O)N[C@@H](Cc1ccc(F)cc1)C(O)=O
InChI Key: InChIKey=JQZNUGKWTQHGEY-RXVVDRJESA-N
Data: 1 IC50
Activity Spreadsheet -- Enzyme Inhibition Constant Data from BindingDB
Found 1 hit for monomerid = 50109976
Trg + Lig
Ki
nM
ΔG°
kcal/mole
IC50
nM
Kd
nM
EC50/IC50
nM
koff
s-1
kon
M-1s-1
pHTemp
°C
Fibronectin receptor beta/Integrin alpha-4
(Homo sapiens (Human))
BDBM50109976
((S)-2-{[(S)-1-(3,5-Dichloro-benzenesulfonyl)-2-met...)
Show SMILES C[C@]1(CCCN1S(=O)(=O)c1cc(Cl)cc(Cl)c1)C(=O)N[C@@H](Cc1ccc(F)cc1)C(O)=O
Show InChI InChI=1S/C21H21Cl2FN2O5S/c1-21(20(29)25-18(19(27)28)9-13-3-5-16(24)6-4-13)7-2-8-26(21)32(30,31)17-11-14(22)10-15(23)12-17/h3-6,10-12,18H,2,7-9H2,1H3,(H,25,29)(H,27,28)/t18-,21-/m0/s1
Reactome pathway
n/an/a 1.20n/an/an/an/an/an/a
Merck Research Laboratories
Curated by ChEMBL
Assay Description
Inhibitory activity against very late antigen-4 (VLA-4) using VCAM-Ig ligand.
Bioorg Med Chem Lett 12: 637-40 (2002)
BindingDB Entry DOI: 10.7270/Q2XD110X