BDBM50109993 (S)-2-{[(S)-1-(3,5-Dichloro-benzenesulfonyl)-pyrrolidine-2-carbonyl]-amino}-3-(3,4-difluoro-phenyl)-propionic acid::CHEMBL345193
SMILES: OC(=O)[C@H](Cc1ccc(F)c(F)c1)NC(=O)[C@@H]1CCCN1S(=O)(=O)c1cc(Cl)cc(Cl)c1
InChI Key: InChIKey=HLUUKMWLLADVRH-ROUUACIJSA-N
Data: 1 IC50
Activity Spreadsheet -- Enzyme Inhibition Constant Data from BindingDB
Found 1 hit for monomerid = 50109993
Trg + Lig
Ki
nM
ΔG°
kcal/mole
IC50
nM
Kd
nM
EC50/IC50
nM
koff
s-1
kon
M-1s-1
pHTemp
°C
Fibronectin receptor beta/Integrin alpha-4
(Homo sapiens (Human))
BDBM50109993
((S)-2-{[(S)-1-(3,5-Dichloro-benzenesulfonyl)-pyrro...)
Show SMILES OC(=O)[C@H](Cc1ccc(F)c(F)c1)NC(=O)[C@@H]1CCCN1S(=O)(=O)c1cc(Cl)cc(Cl)c1
Show InChI InChI=1S/C20H18Cl2F2N2O5S/c21-12-8-13(22)10-14(9-12)32(30,31)26-5-1-2-18(26)19(27)25-17(20(28)29)7-11-3-4-15(23)16(24)6-11/h3-4,6,8-10,17-18H,1-2,5,7H2,(H,25,27)(H,28,29)/t17-,18-/m0/s1
Reactome pathway
n/an/a 0.480n/an/an/an/an/an/a
Merck Research Laboratories
Curated by ChEMBL
Assay Description
Inhibitory activity against very late antigen-4 (VLA-4) using VCAM-Ig ligand.
Bioorg Med Chem Lett 12: 637-40 (2002)
BindingDB Entry DOI: 10.7270/Q2XD110X