null
SMILES: Cc1ccnc(NCCCCC(=O)NCC(=O)NC(CC(O)=O)c2cc(Cl)cc(Cl)c2)c1
InChI Key: InChIKey=ZXXBSSKQLMNDPX-UHFFFAOYSA-N
Activity Spreadsheet -- Enzyme Inhibition Constant Data from BindingDB
Found 7 hits for monomerid = 50110236
Trg + Lig
Ki
nM
ΔG°
kcal/mole
IC50
nM
Kd
nM
EC50/IC50
nM
koff
s-1
kon
M-1s-1
pHTemp
°C
Integrin alpha-V/beta-5
(Homo sapiens (Human))
BDBM50110236
(3-(3,5-Dichloro-phenyl)-3-{2-[5-(4-methyl-pyridin-...)
Show SMILES Cc1ccnc(NCCCCC(=O)NCC(=O)NC(CC(O)=O)c2cc(Cl)cc(Cl)c2)c1
Show InChI InChI=1S/C22H26Cl2N4O4/c1-14-5-7-26-19(8-14)25-6-3-2-4-20(29)27-13-21(30)28-18(12-22(31)32)15-9-16(23)11-17(24)10-15/h5,7-11,18H,2-4,6,12-13H2,1H3,(H,25,26)(H,27,29)(H,28,30)(H,31,32)
NCI pathway
Reactome pathway
n/an/a 350n/an/an/an/an/an/a
Merck KGaA
Curated by ChEMBL
Assay Description
Inhibition of vitronectin binding to recombinant human alphaV-beta5 integrin
J Med Chem 45: 1045-51 (2002)
BindingDB Entry DOI: 10.7270/Q2RR1XJR
Integrin alpha-V/beta-5
(Homo sapiens (Human))
BDBM50110236
(3-(3,5-Dichloro-phenyl)-3-{2-[5-(4-methyl-pyridin-...)
Show SMILES Cc1ccnc(NCCCCC(=O)NCC(=O)NC(CC(O)=O)c2cc(Cl)cc(Cl)c2)c1
Show InChI InChI=1S/C22H26Cl2N4O4/c1-14-5-7-26-19(8-14)25-6-3-2-4-20(29)27-13-21(30)28-18(12-22(31)32)15-9-16(23)11-17(24)10-15/h5,7-11,18H,2-4,6,12-13H2,1H3,(H,25,26)(H,27,29)(H,28,30)(H,31,32)
NCI pathway
Reactome pathway
n/an/a 2.00E+3n/an/an/an/an/an/a
Merck KGaA
Curated by ChEMBL
Assay Description
Inhibition of integrin alpha-v/beta-5 mediated UCLAP-3 cell adhesion on vitronectin
J Med Chem 45: 1045-51 (2002)
BindingDB Entry DOI: 10.7270/Q2RR1XJR
Integrin alpha-IIb/beta-3
(Homo sapiens (Human))
BDBM50110236
(3-(3,5-Dichloro-phenyl)-3-{2-[5-(4-methyl-pyridin-...)
Show SMILES Cc1ccnc(NCCCCC(=O)NCC(=O)NC(CC(O)=O)c2cc(Cl)cc(Cl)c2)c1
Show InChI InChI=1S/C22H26Cl2N4O4/c1-14-5-7-26-19(8-14)25-6-3-2-4-20(29)27-13-21(30)28-18(12-22(31)32)15-9-16(23)11-17(24)10-15/h5,7-11,18H,2-4,6,12-13H2,1H3,(H,25,26)(H,27,29)(H,28,30)(H,31,32)
n/an/a>1.00E+4n/an/an/an/an/an/a
Merck KGaA
Curated by ChEMBL
Assay Description
Inhibition of fibrinogen binding to recombinant human platelet glycoprotein alpha IIb beta3 integrin
J Med Chem 45: 1045-51 (2002)
BindingDB Entry DOI: 10.7270/Q2RR1XJR
Integrin alpha-V/beta-6
(Homo sapiens (Human))
BDBM50110236
(3-(3,5-Dichloro-phenyl)-3-{2-[5-(4-methyl-pyridin-...)
Show SMILES Cc1ccnc(NCCCCC(=O)NCC(=O)NC(CC(O)=O)c2cc(Cl)cc(Cl)c2)c1
Show InChI InChI=1S/C22H26Cl2N4O4/c1-14-5-7-26-19(8-14)25-6-3-2-4-20(29)27-13-21(30)28-18(12-22(31)32)15-9-16(23)11-17(24)10-15/h5,7-11,18H,2-4,6,12-13H2,1H3,(H,25,26)(H,27,29)(H,28,30)(H,31,32)
n/an/a 300n/an/an/an/an/an/a
Merck KGaA
Curated by ChEMBL
Assay Description
Inhibition of integrin alpha-v/beta-6 mediated UCLAP-3 cell adhesion to fibronectin
J Med Chem 45: 1045-51 (2002)
BindingDB Entry DOI: 10.7270/Q2RR1XJR
Integrin alpha-V/beta-6
(Homo sapiens (Human))
BDBM50110236
(3-(3,5-Dichloro-phenyl)-3-{2-[5-(4-methyl-pyridin-...)
Show SMILES Cc1ccnc(NCCCCC(=O)NCC(=O)NC(CC(O)=O)c2cc(Cl)cc(Cl)c2)c1
Show InChI InChI=1S/C22H26Cl2N4O4/c1-14-5-7-26-19(8-14)25-6-3-2-4-20(29)27-13-21(30)28-18(12-22(31)32)15-9-16(23)11-17(24)10-15/h5,7-11,18H,2-4,6,12-13H2,1H3,(H,25,26)(H,27,29)(H,28,30)(H,31,32)
n/an/a 0.400n/an/an/an/an/an/a
Merck KGaA
Curated by ChEMBL
Assay Description
Inhibition of fibronectin binding to recombinant human alphaV-beta6 integrin
J Med Chem 45: 1045-51 (2002)
BindingDB Entry DOI: 10.7270/Q2RR1XJR
Integrin alpha-V/beta-3
(Homo sapiens (Human))
BDBM50110236
(3-(3,5-Dichloro-phenyl)-3-{2-[5-(4-methyl-pyridin-...)
Show SMILES Cc1ccnc(NCCCCC(=O)NCC(=O)NC(CC(O)=O)c2cc(Cl)cc(Cl)c2)c1
Show InChI InChI=1S/C22H26Cl2N4O4/c1-14-5-7-26-19(8-14)25-6-3-2-4-20(29)27-13-21(30)28-18(12-22(31)32)15-9-16(23)11-17(24)10-15/h5,7-11,18H,2-4,6,12-13H2,1H3,(H,25,26)(H,27,29)(H,28,30)(H,31,32)
n/an/a 53n/an/an/an/an/an/a
Merck KGaA
Curated by ChEMBL
Assay Description
Inhibition of vitronectin binding to recombinant human alphaV-beta3 integrin
J Med Chem 45: 1045-51 (2002)
BindingDB Entry DOI: 10.7270/Q2RR1XJR
Integrin alpha-V/beta-3
(Homo sapiens (Human))
BDBM50110236
(3-(3,5-Dichloro-phenyl)-3-{2-[5-(4-methyl-pyridin-...)
Show SMILES Cc1ccnc(NCCCCC(=O)NCC(=O)NC(CC(O)=O)c2cc(Cl)cc(Cl)c2)c1
Show InChI InChI=1S/C22H26Cl2N4O4/c1-14-5-7-26-19(8-14)25-6-3-2-4-20(29)27-13-21(30)28-18(12-22(31)32)15-9-16(23)11-17(24)10-15/h5,7-11,18H,2-4,6,12-13H2,1H3,(H,25,26)(H,27,29)(H,28,30)(H,31,32)
n/an/a 1.60E+4n/an/an/an/an/an/a
Merck KGaA
Curated by ChEMBL
Assay Description
Inhibition of integrin alpha-v/beta-3 mediated M21 cell adhesion to vitronectin with monoclonal antibody P1F6
J Med Chem 45: 1045-51 (2002)
BindingDB Entry DOI: 10.7270/Q2RR1XJR