BDBM50110275 CGNLSTCBLGTYTQDF[DKFHO]YPQTAIGVGAP-amide::CHEMBL2369915
SMILES: CCCC[C@H](NC(=O)[C@H](CS)NC(=O)[C@@H](NC(=O)[C@H](CO)NC(=O)[C@H](CC(C)C)NC(=O)[C@H](CC(N)=O)NC(=O)CNC(=O)[C@@H](N)CS)[C@@H](C)O)C(=O)N[C@@H](CC(C)C)C(=O)NCC(=O)N[C@@H]([C@@H](C)O)C(=O)N[C@@H](Cc1ccccc1)C(=O)N[C@@H]([C@@H](C)O)C(=O)N[C@@H](CCC(N)=O)C(=O)N[C@@H](CC(O)=O)C(=O)N[C@@H](Cc1ccccc1)C(=O)N[C@H]1CC(=O)NCCC[C@H](NC(Cc2cnc[nH]2)C(=O)NC(Cc2ccccc2)C(=O)[C@H](CCCCN)NC1=O)C(=O)N[C@@H](Cc1ccc(O)cc1)C(=O)N1CCC[C@@H]1C(=O)N[C@@H](CCC(N)=O)C(=O)N[C@@H]([C@@H](C)O)C(=O)N[C@@H](C)C(=O)N[C@@H]([C@@H](C)CC)C(=O)NCC(=O)N[C@@H](C(C)C)C(=O)NCC(=O)N[C@@H](C)C(=O)N1CCC[C@@H]1C(N)=O
InChI Key: InChIKey=NRTVMMGXEUIAJK-RZPNVICESA-N
Data: 1 KI  1 IC50
Activity Spreadsheet -- Enzyme Inhibition Constant Data from BindingDB
Found 2 hits for monomerid = 50110275
Trg + Lig
Ki
nM
ΔG°
kcal/mole
IC50
nM
Kd
nM
EC50/IC50
nM
koff
s-1
kon
M-1s-1
pHTemp
°C
Calcitonin receptor
(Homo sapiens (Human))
BDBM50110275
(CGNLSTCBLGTYTQDF[DKFHO]YPQTAIGVGAP-amide | CHEMBL2...)
Show SMILES CCCC[C@H](NC(=O)[C@H](CS)NC(=O)[C@@H](NC(=O)[C@H](CO)NC(=O)[C@H](CC(C)C)NC(=O)[C@H](CC(N)=O)NC(=O)CNC(=O)[C@@H](N)CS)[C@@H](C)O)C(=O)N[C@@H](CC(C)C)C(=O)NCC(=O)N[C@@H]([C@@H](C)O)C(=O)N[C@@H](Cc1ccccc1)C(=O)N[C@@H]([C@@H](C)O)C(=O)N[C@@H](CCC(N)=O)C(=O)N[C@@H](CC(O)=O)C(=O)N[C@@H](Cc1ccccc1)C(=O)N[C@H]1CC(=O)NCCC[C@H](NC(Cc2cnc[nH]2)C(=O)NC(Cc2ccccc2)C(=O)[C@H](CCCCN)NC1=O)C(=O)N[C@@H](Cc1ccc(O)cc1)C(=O)N1CCC[C@@H]1C(=O)N[C@@H](CCC(N)=O)C(=O)N[C@@H]([C@@H](C)O)C(=O)N[C@@H](C)C(=O)N[C@@H]([C@@H](C)CC)C(=O)NCC(=O)N[C@@H](C(C)C)C(=O)NCC(=O)N[C@@H](C)C(=O)N1CCC[C@@H]1C(N)=O
Show InChI InChI=1S/C152H229N39O43S2/c1-16-18-39-94(171-143(225)108(73-236)183-150(232)125(84(15)196)189-142(224)107(71-192)182-135(217)99(57-76(5)6)176-138(220)103(63-113(157)200)169-116(203)68-161-129(211)91(154)72-235)132(214)175-98(56-75(3)4)130(212)162-69-118(205)185-122(81(12)193)148(230)180-101(60-87-37-26-21-27-38-87)141(223)188-124(83(14)195)149(231)173-95(48-50-111(155)198)133(215)179-105(65-119(206)207)140(222)177-100(59-86-35-24-20-25-36-86)136(218)178-104-64-114(201)160-53-30-41-93(168-102(62-89-66-159-74-165-89)137(219)174-97(58-85-33-22-19-23-34-85)126(208)92(170-139(104)221)40-28-29-52-153)131(213)181-106(61-88-44-46-90(197)47-45-88)152(234)191-55-32-43-110(191)144(226)172-96(49-51-112(156)199)134(216)187-123(82(13)194)147(229)167-79(10)128(210)186-121(78(9)17-2)146(228)164-70-117(204)184-120(77(7)8)145(227)163-67-115(202)166-80(11)151(233)190-54-31-42-109(190)127(158)209/h19-27,33-38,44-47,66,74-84,91-110,120-125,168,192-197,235-236H,16-18,28-32,39-43,48-65,67-73,153-154H2,1-15H3,(H2,155,198)(H2,156,199)(H2,157,200)(H2,158,209)(H,159,165)(H,160,201)(H,161,211)(H,162,212)(H,163,227)(H,164,228)(H,166,202)(H,167,229)(H,169,203)(H,170,221)(H,171,225)(H,172,226)(H,173,231)(H,174,219)(H,175,214)(H,176,220)(H,177,222)(H,178,218)(H,179,215)(H,180,230)(H,181,213)(H,182,217)(H,183,232)(H,184,204)(H,185,205)(H,186,210)(H,187,216)(H,188,223)(H,189,224)(H,206,207)/t78-,79-,80-,81+,82+,83+,84+,91-,92-,93-,94-,95-,96-,97?,98-,99-,100-,101-,102?,103-,104-,105-,106-,107-,108-,109+,110+,120-,121-,122-,123-,124-,125-/m0/s1
Reactome pathway
0.0690n/an/an/an/an/an/an/an/a
Rutgers University
Curated by ChEMBL
Assay Description
Inhibition of [125I]-salmon calcitonin (sCT) binding to human calcitonin receptor I1 expressed in HEK293 cells
J Med Chem 45: 1108-21 (2002)
BindingDB Entry DOI: 10.7270/Q2N015V5
Calcitonin receptor
(Rattus norvegicus)
BDBM50110275
(CGNLSTCBLGTYTQDF[DKFHO]YPQTAIGVGAP-amide | CHEMBL2...)
Show SMILES CCCC[C@H](NC(=O)[C@H](CS)NC(=O)[C@@H](NC(=O)[C@H](CO)NC(=O)[C@H](CC(C)C)NC(=O)[C@H](CC(N)=O)NC(=O)CNC(=O)[C@@H](N)CS)[C@@H](C)O)C(=O)N[C@@H](CC(C)C)C(=O)NCC(=O)N[C@@H]([C@@H](C)O)C(=O)N[C@@H](Cc1ccccc1)C(=O)N[C@@H]([C@@H](C)O)C(=O)N[C@@H](CCC(N)=O)C(=O)N[C@@H](CC(O)=O)C(=O)N[C@@H](Cc1ccccc1)C(=O)N[C@H]1CC(=O)NCCC[C@H](NC(Cc2cnc[nH]2)C(=O)NC(Cc2ccccc2)C(=O)[C@H](CCCCN)NC1=O)C(=O)N[C@@H](Cc1ccc(O)cc1)C(=O)N1CCC[C@@H]1C(=O)N[C@@H](CCC(N)=O)C(=O)N[C@@H]([C@@H](C)O)C(=O)N[C@@H](C)C(=O)N[C@@H]([C@@H](C)CC)C(=O)NCC(=O)N[C@@H](C(C)C)C(=O)NCC(=O)N[C@@H](C)C(=O)N1CCC[C@@H]1C(N)=O
Show InChI InChI=1S/C152H229N39O43S2/c1-16-18-39-94(171-143(225)108(73-236)183-150(232)125(84(15)196)189-142(224)107(71-192)182-135(217)99(57-76(5)6)176-138(220)103(63-113(157)200)169-116(203)68-161-129(211)91(154)72-235)132(214)175-98(56-75(3)4)130(212)162-69-118(205)185-122(81(12)193)148(230)180-101(60-87-37-26-21-27-38-87)141(223)188-124(83(14)195)149(231)173-95(48-50-111(155)198)133(215)179-105(65-119(206)207)140(222)177-100(59-86-35-24-20-25-36-86)136(218)178-104-64-114(201)160-53-30-41-93(168-102(62-89-66-159-74-165-89)137(219)174-97(58-85-33-22-19-23-34-85)126(208)92(170-139(104)221)40-28-29-52-153)131(213)181-106(61-88-44-46-90(197)47-45-88)152(234)191-55-32-43-110(191)144(226)172-96(49-51-112(156)199)134(216)187-123(82(13)194)147(229)167-79(10)128(210)186-121(78(9)17-2)146(228)164-70-117(204)184-120(77(7)8)145(227)163-67-115(202)166-80(11)151(233)190-54-31-42-109(190)127(158)209/h19-27,33-38,44-47,66,74-84,91-110,120-125,168,192-197,235-236H,16-18,28-32,39-43,48-65,67-73,153-154H2,1-15H3,(H2,155,198)(H2,156,199)(H2,157,200)(H2,158,209)(H,159,165)(H,160,201)(H,161,211)(H,162,212)(H,163,227)(H,164,228)(H,166,202)(H,167,229)(H,169,203)(H,170,221)(H,171,225)(H,172,226)(H,173,231)(H,174,219)(H,175,214)(H,176,220)(H,177,222)(H,178,218)(H,179,215)(H,180,230)(H,181,213)(H,182,217)(H,183,232)(H,184,204)(H,185,205)(H,186,210)(H,187,216)(H,188,223)(H,189,224)(H,206,207)/t78-,79-,80-,81+,82+,83+,84+,91-,92-,93-,94-,95-,96-,97?,98-,99-,100-,101-,102?,103-,104-,105-,106-,107-,108-,109+,110+,120-,121-,122-,123-,124-,125-/m0/s1
Reactome pathway
n/an/a 0.408n/an/an/an/an/an/a
Rutgers University
Curated by ChEMBL
Assay Description
Displacement of [125I]-salmon calcitonin (sCT) from calcitonin receptor of rat brain
J Med Chem 45: 1108-21 (2002)
BindingDB Entry DOI: 10.7270/Q2N015V5