BDBM50110360 CHEMBL3605452
SMILES: COC[C@@H](C)n1c(C)c(C(=O)NCc2c(C)cc(C)nc2O)c2ccccc12
InChI Key: InChIKey=WKFRRFRFXHKQES-OAHLLOKOSA-N
Data: 3 IC50
Activity Spreadsheet -- Enzyme Inhibition Constant Data from BindingDB
Found 3 hits for monomerid = 50110360
Trg + Lig
Ki
nM
ΔG°
kcal/mole
IC50
nM
Kd
nM
EC50/IC50
nM
koff
s-1
kon
M-1s-1
pHTemp
°C
Histone-lysine N-methyltransferase EZH2
(Homo sapiens (Human))
BDBM50110360
(CHEMBL3605452)
Show SMILES COC[C@@H](C)n1c(C)c(C(=O)NCc2c(C)cc(C)nc2O)c2ccccc12 |r|
Show InChI InChI=1S/C22H27N3O3/c1-13-10-14(2)24-21(26)18(13)11-23-22(27)20-16(4)25(15(3)12-28-5)19-9-7-6-8-17(19)20/h6-10,15H,11-12H2,1-5H3,(H,23,27)(H,24,26)/t15-/m1/s1
n/an/a 43n/an/an/an/an/an/a
Constellation Pharmaceuticals, Inc.
Curated by ChEMBL
Assay Description
Inhibition of EZH2 Y641N mutant (unknown origin) using biotinylated nucleosome, H3K27me3 activator and [3H]-SAM incubated for 60 mins by top-count ba...
Bioorg Med Chem Lett 25: 3644-9 (2015)
BindingDB Entry DOI: 10.7270/Q2Q24205
Histone-lysine N-methyltransferase EZH2
(Homo sapiens (Human))
BDBM50110360
(CHEMBL3605452)
Show SMILES COC[C@@H](C)n1c(C)c(C(=O)NCc2c(C)cc(C)nc2O)c2ccccc12 |r|
Show InChI InChI=1S/C22H27N3O3/c1-13-10-14(2)24-21(26)18(13)11-23-22(27)20-16(4)25(15(3)12-28-5)19-9-7-6-8-17(19)20/h6-10,15H,11-12H2,1-5H3,(H,23,27)(H,24,26)/t15-/m1/s1
n/an/a 703n/an/an/an/an/an/a
Constellation Pharmaceuticals, Inc.
Curated by ChEMBL
Assay Description
Inhibition of EZH2 in human HeLa cells assessed as reduction in H3K27me3 levels incubated for 72 hrs by ELISA method
Bioorg Med Chem Lett 25: 3644-9 (2015)
BindingDB Entry DOI: 10.7270/Q2Q24205
Histone-lysine N-methyltransferase EZH2
(Homo sapiens (Human))
BDBM50110360
(CHEMBL3605452)
Show SMILES COC[C@@H](C)n1c(C)c(C(=O)NCc2c(C)cc(C)nc2O)c2ccccc12 |r|
Show InChI InChI=1S/C22H27N3O3/c1-13-10-14(2)24-21(26)18(13)11-23-22(27)20-16(4)25(15(3)12-28-5)19-9-7-6-8-17(19)20/h6-10,15H,11-12H2,1-5H3,(H,23,27)(H,24,26)/t15-/m1/s1
n/an/a 5n/an/an/an/an/an/a
Constellation Pharmaceuticals, Inc.
Curated by ChEMBL
Assay Description
Inhibition of EZH2 (unknown origin) using biotinylated nucleosome, H3K27me3 activator and [3H]-SAM incubated for 60 mins by top-count based method
Bioorg Med Chem Lett 25: 3644-9 (2015)
BindingDB Entry DOI: 10.7270/Q2Q24205