BDBM50110439 CHEMBL3605784
SMILES: Cc1ccc(cc1)-c1c[nH]c(n1)C1(CCC1)NCc1c[nH]c2ccccc12
InChI Key: InChIKey=YXMKBKUMFZIOMD-UHFFFAOYSA-N
Data: 1 KI  1 EC50
Activity Spreadsheet -- Enzyme Inhibition Constant Data from BindingDB
Found 2 hits for monomerid = 50110439
Trg + Lig
Ki
nM
ΔG°
kcal/mole
IC50
nM
Kd
nM
EC50/IC50
nM
koff
s-1
kon
M-1s-1
pHTemp
°C
Somatostatin receptor type 3
(Homo sapiens (Human))
BDBM50110439
(CHEMBL3605784)
Show SMILES Cc1ccc(cc1)-c1c[nH]c(n1)C1(CCC1)NCc1c[nH]c2ccccc12
Show InChI InChI=1S/C23H24N4/c1-16-7-9-17(10-8-16)21-15-25-22(27-21)23(11-4-12-23)26-14-18-13-24-20-6-3-2-5-19(18)20/h2-3,5-10,13,15,24,26H,4,11-12,14H2,1H3,(H,25,27)
Reactome pathway
51n/an/an/an/an/an/an/an/a
Merck Research Laboratories
Curated by ChEMBL
Assay Description
Displacement of [125I]SS-14 from human SSTR3 expressed in CHO cells after 60 to 90 mins
Bioorg Med Chem Lett 25: 3520-5 (2015)
BindingDB Entry DOI: 10.7270/Q29W0H9M
Somatostatin receptor type 3
(Homo sapiens (Human))
BDBM50110439
(CHEMBL3605784)
Show SMILES Cc1ccc(cc1)-c1c[nH]c(n1)C1(CCC1)NCc1c[nH]c2ccccc12
Show InChI InChI=1S/C23H24N4/c1-16-7-9-17(10-8-16)21-15-25-22(27-21)23(11-4-12-23)26-14-18-13-24-20-6-3-2-5-19(18)20/h2-3,5-10,13,15,24,26H,4,11-12,14H2,1H3,(H,25,27)
Reactome pathway
n/an/an/an/a 160n/an/an/an/a
Merck Research Laboratories
Curated by ChEMBL
Assay Description
Agonist activity at human SSTR3 expressed in CHO cells assessed as intracellular cAMP level after 45 mins by time-resolved fluorescence assay
Bioorg Med Chem Lett 25: 3520-5 (2015)
BindingDB Entry DOI: 10.7270/Q29W0H9M