BDBM50110488 CHEMBL3605810
SMILES: Cc1ccc(cc1)-c1c[nH]c(n1)C1(CCCC1)NCc1ccc(cc1)-c1ccccc1
InChI Key: InChIKey=URLKHZPSVKVUOF-UHFFFAOYSA-N
Data: 1 KI  1 EC50
Activity Spreadsheet -- Enzyme Inhibition Constant Data from BindingDB
Found 2 hits for monomerid = 50110488
Trg + Lig
Ki
nM
ΔG°
kcal/mole
IC50
nM
Kd
nM
EC50/IC50
nM
koff
s-1
kon
M-1s-1
pHTemp
°C
Somatostatin receptor type 3
(Homo sapiens (Human))
BDBM50110488
(CHEMBL3605810)
Show SMILES Cc1ccc(cc1)-c1c[nH]c(n1)C1(CCCC1)NCc1ccc(cc1)-c1ccccc1
Show InChI InChI=1S/C28H29N3/c1-21-9-13-25(14-10-21)26-20-29-27(31-26)28(17-5-6-18-28)30-19-22-11-15-24(16-12-22)23-7-3-2-4-8-23/h2-4,7-16,20,30H,5-6,17-19H2,1H3,(H,29,31)
Reactome pathway
160n/an/an/an/an/an/an/an/a
Merck Research Laboratories
Curated by ChEMBL
Assay Description
Displacement of [125I]SS-14 from human SSTR3 expressed in CHO cells after 60 to 90 mins
Bioorg Med Chem Lett 25: 3520-5 (2015)
BindingDB Entry DOI: 10.7270/Q29W0H9M
Somatostatin receptor type 3
(Homo sapiens (Human))
BDBM50110488
(CHEMBL3605810)
Show SMILES Cc1ccc(cc1)-c1c[nH]c(n1)C1(CCCC1)NCc1ccc(cc1)-c1ccccc1
Show InChI InChI=1S/C28H29N3/c1-21-9-13-25(14-10-21)26-20-29-27(31-26)28(17-5-6-18-28)30-19-22-11-15-24(16-12-22)23-7-3-2-4-8-23/h2-4,7-16,20,30H,5-6,17-19H2,1H3,(H,29,31)
Reactome pathway
n/an/an/an/a 2.30E+3n/an/an/an/a
Merck Research Laboratories
Curated by ChEMBL
Assay Description
Agonist activity at human SSTR3 expressed in CHO cells assessed as intracellular cAMP level after 45 mins by time-resolved fluorescence assay
Bioorg Med Chem Lett 25: 3520-5 (2015)
BindingDB Entry DOI: 10.7270/Q29W0H9M