BDBM50110581 CHEMBL3605819
SMILES: CC(C)(C)c1ccc(NC(=O)N2Cc3ccc(cc3C2)S(=O)(=O)Nc2ccc(F)cc2)cc1
InChI Key: InChIKey=MKXWCSGELYEECH-UHFFFAOYSA-N
Data: 2 IC50
Activity Spreadsheet -- Enzyme Inhibition Constant Data from BindingDB
Found 2 hits for monomerid = 50110581
Trg + Lig
Ki
nM
ΔG°
kcal/mole
IC50
nM
Kd
nM
EC50/IC50
nM
koff
s-1
kon
M-1s-1
pHTemp
°C
Acyl-CoA:monoacylglycerol acyltransferase 2 (MOGAT2)
(Homo sapiens (Human))
BDBM50110581
(CHEMBL3605819)
Show SMILES CC(C)(C)c1ccc(NC(=O)N2Cc3ccc(cc3C2)S(=O)(=O)Nc2ccc(F)cc2)cc1
Show InChI InChI=1S/C25H26FN3O3S/c1-25(2,3)19-5-9-21(10-6-19)27-24(30)29-15-17-4-13-23(14-18(17)16-29)33(31,32)28-22-11-7-20(26)8-12-22/h4-14,28H,15-16H2,1-3H3,(H,27,30)
n/an/a 594n/an/an/an/an/an/a
Taisho Pharmaceutical Co., Ltd
Curated by ChEMBL
Assay Description
Inhibition of human recombinant MGAT2 assessed as reduction in enzyme-mediated deacylation of oleoyl-CoA incubated for 20 mins by CPM dye based fluor...
Bioorg Med Chem 23: 5922-31 (2015)
BindingDB Entry DOI: 10.7270/Q2639RJ6
2-acylglycerol O-acyltransferase 2
(Mus musculus)
BDBM50110581
(CHEMBL3605819)
Show SMILES CC(C)(C)c1ccc(NC(=O)N2Cc3ccc(cc3C2)S(=O)(=O)Nc2ccc(F)cc2)cc1
Show InChI InChI=1S/C25H26FN3O3S/c1-25(2,3)19-5-9-21(10-6-19)27-24(30)29-15-17-4-13-23(14-18(17)16-29)33(31,32)28-22-11-7-20(26)8-12-22/h4-14,28H,15-16H2,1-3H3,(H,27,30)
n/an/a 1.31E+3n/an/an/an/an/an/a
Taisho Pharmaceutical Co., Ltd
Curated by ChEMBL
Assay Description
Inhibition of mouse recombinant MGAT2 assessed as reduction in enzyme-mediated deacylation of oleoyl-CoA incubated for 20 mins by CPM dye based fluor...
Bioorg Med Chem 23: 5922-31 (2015)
BindingDB Entry DOI: 10.7270/Q2639RJ6