null
SMILES: COc1cc(F)ccc1-c1c(Cc2ccccc2)[nH]c2c(NS(C)(=O)=O)cc(cc12)C(C)C
InChI Key: InChIKey=DLHJAQJQFLHXNZ-UHFFFAOYSA-N
Activity Spreadsheet -- Enzyme Inhibition Constant Data from BindingDB
Found 6 hits for monomerid = 50110732
Trg + Lig
Ki
nM
ΔG°
kcal/mole
IC50
nM
Kd
nM
EC50/IC50
nM
koff
s-1
kon
M-1s-1
pHTemp
°C
Glucocorticoid receptor
(Homo sapiens (Human))
BDBM50110732
(CHEMBL3605927)
Show SMILES COc1cc(F)ccc1-c1c(Cc2ccccc2)[nH]c2c(NS(C)(=O)=O)cc(cc12)C(C)C |(-1,4.66,;-.24,3.69,;1.29,3.91,;1.86,5.34,;3.38,5.55,;3.84,6.7,;4.33,4.34,;3.76,2.91,;2.23,2.7,;1.76,1.24,;2.66,.02,;4.2,.03,;4.98,-1.29,;6.52,-1.28,;7.3,-2.61,;6.54,-3.95,;5,-3.96,;4.22,-2.63,;1.76,-1.24,;.3,-.77,;-1.03,-1.55,;-1.02,-3.09,;-2.35,-3.87,;-3.42,-3.26,;-2.35,-5.1,;-3.42,-4.49,;-2.38,-.77,;-2.38,.77,;-1.03,1.55,;.3,.77,;-3.72,1.53,;-3.72,2.76,;-4.78,.91,)|
Show InChI InChI=1S/C26H27FN2O3S/c1-16(2)18-13-21-25(20-11-10-19(27)15-24(20)32-3)22(12-17-8-6-5-7-9-17)28-26(21)23(14-18)29-33(4,30)31/h5-11,13-16,28-29H,12H2,1-4H3
0.543n/an/an/an/an/an/an/an/a
Eli Lilly Biotechnology Center
Curated by ChEMBL
Assay Description
Displacement of [3H]-dexamethasone from human glucocorticoid receptor expressed in HEK293 cells by scintillation counting based radioligand competiti...
J Med Chem 58: 6607-18 (2015)
BindingDB Entry DOI: 10.7270/Q2ST7RMV
Androgen receptor
(Homo sapiens (Human))
BDBM50110732
(CHEMBL3605927)
Show SMILES COc1cc(F)ccc1-c1c(Cc2ccccc2)[nH]c2c(NS(C)(=O)=O)cc(cc12)C(C)C |(-1,4.66,;-.24,3.69,;1.29,3.91,;1.86,5.34,;3.38,5.55,;3.84,6.7,;4.33,4.34,;3.76,2.91,;2.23,2.7,;1.76,1.24,;2.66,.02,;4.2,.03,;4.98,-1.29,;6.52,-1.28,;7.3,-2.61,;6.54,-3.95,;5,-3.96,;4.22,-2.63,;1.76,-1.24,;.3,-.77,;-1.03,-1.55,;-1.02,-3.09,;-2.35,-3.87,;-3.42,-3.26,;-2.35,-5.1,;-3.42,-4.49,;-2.38,-.77,;-2.38,.77,;-1.03,1.55,;.3,.77,;-3.72,1.53,;-3.72,2.76,;-4.78,.91,)|
Show InChI InChI=1S/C26H27FN2O3S/c1-16(2)18-13-21-25(20-11-10-19(27)15-24(20)32-3)22(12-17-8-6-5-7-9-17)28-26(21)23(14-18)29-33(4,30)31/h5-11,13-16,28-29H,12H2,1-4H3
NCI pathway
Reactome pathway
684n/an/an/an/an/an/an/an/a
Eli Lilly Biotechnology Center
Curated by ChEMBL
Assay Description
Displacement of [3H]-methyltrienolone from human androgen receptor expressed in HEK293 cells by scintillation counting based radioligand competition ...
J Med Chem 58: 6607-18 (2015)
BindingDB Entry DOI: 10.7270/Q2ST7RMV
Progesterone receptor
(Homo sapiens (Human))
BDBM50110732
(CHEMBL3605927)
Show SMILES COc1cc(F)ccc1-c1c(Cc2ccccc2)[nH]c2c(NS(C)(=O)=O)cc(cc12)C(C)C |(-1,4.66,;-.24,3.69,;1.29,3.91,;1.86,5.34,;3.38,5.55,;3.84,6.7,;4.33,4.34,;3.76,2.91,;2.23,2.7,;1.76,1.24,;2.66,.02,;4.2,.03,;4.98,-1.29,;6.52,-1.28,;7.3,-2.61,;6.54,-3.95,;5,-3.96,;4.22,-2.63,;1.76,-1.24,;.3,-.77,;-1.03,-1.55,;-1.02,-3.09,;-2.35,-3.87,;-3.42,-3.26,;-2.35,-5.1,;-3.42,-4.49,;-2.38,-.77,;-2.38,.77,;-1.03,1.55,;.3,.77,;-3.72,1.53,;-3.72,2.76,;-4.78,.91,)|
Show InChI InChI=1S/C26H27FN2O3S/c1-16(2)18-13-21-25(20-11-10-19(27)15-24(20)32-3)22(12-17-8-6-5-7-9-17)28-26(21)23(14-18)29-33(4,30)31/h5-11,13-16,28-29H,12H2,1-4H3
4.00E+3n/an/an/an/an/an/an/an/a
Eli Lilly Biotechnology Center
Curated by ChEMBL
Assay Description
Displacement of [3H]-progesterone from human progesterone receptor expressed in HEK293 cells by scintillation counting based radioligand competition ...
J Med Chem 58: 6607-18 (2015)
BindingDB Entry DOI: 10.7270/Q2ST7RMV
Mineralocorticoid receptor
(Homo sapiens (Human))
BDBM50110732
(CHEMBL3605927)
Show SMILES COc1cc(F)ccc1-c1c(Cc2ccccc2)[nH]c2c(NS(C)(=O)=O)cc(cc12)C(C)C |(-1,4.66,;-.24,3.69,;1.29,3.91,;1.86,5.34,;3.38,5.55,;3.84,6.7,;4.33,4.34,;3.76,2.91,;2.23,2.7,;1.76,1.24,;2.66,.02,;4.2,.03,;4.98,-1.29,;6.52,-1.28,;7.3,-2.61,;6.54,-3.95,;5,-3.96,;4.22,-2.63,;1.76,-1.24,;.3,-.77,;-1.03,-1.55,;-1.02,-3.09,;-2.35,-3.87,;-3.42,-3.26,;-2.35,-5.1,;-3.42,-4.49,;-2.38,-.77,;-2.38,.77,;-1.03,1.55,;.3,.77,;-3.72,1.53,;-3.72,2.76,;-4.78,.91,)|
Show InChI InChI=1S/C26H27FN2O3S/c1-16(2)18-13-21-25(20-11-10-19(27)15-24(20)32-3)22(12-17-8-6-5-7-9-17)28-26(21)23(14-18)29-33(4,30)31/h5-11,13-16,28-29H,12H2,1-4H3
4.25E+3n/an/an/an/an/an/an/an/a
Eli Lilly Biotechnology Center
Curated by ChEMBL
Assay Description
Displacement of [3H]-aldosterone from human mineralocorticoid receptor expressed in HEK293 cells by scintillation counting based radioligand competit...
J Med Chem 58: 6607-18 (2015)
BindingDB Entry DOI: 10.7270/Q2ST7RMV
Glucocorticoid receptor
(Homo sapiens (Human))
BDBM50110732
(CHEMBL3605927)
Show SMILES COc1cc(F)ccc1-c1c(Cc2ccccc2)[nH]c2c(NS(C)(=O)=O)cc(cc12)C(C)C |(-1,4.66,;-.24,3.69,;1.29,3.91,;1.86,5.34,;3.38,5.55,;3.84,6.7,;4.33,4.34,;3.76,2.91,;2.23,2.7,;1.76,1.24,;2.66,.02,;4.2,.03,;4.98,-1.29,;6.52,-1.28,;7.3,-2.61,;6.54,-3.95,;5,-3.96,;4.22,-2.63,;1.76,-1.24,;.3,-.77,;-1.03,-1.55,;-1.02,-3.09,;-2.35,-3.87,;-3.42,-3.26,;-2.35,-5.1,;-3.42,-4.49,;-2.38,-.77,;-2.38,.77,;-1.03,1.55,;.3,.77,;-3.72,1.53,;-3.72,2.76,;-4.78,.91,)|
Show InChI InChI=1S/C26H27FN2O3S/c1-16(2)18-13-21-25(20-11-10-19(27)15-24(20)32-3)22(12-17-8-6-5-7-9-17)28-26(21)23(14-18)29-33(4,30)31/h5-11,13-16,28-29H,12H2,1-4H3
n/an/a 7.5n/an/an/an/an/an/a
Eli Lilly Biotechnology Center
Curated by ChEMBL
Assay Description
Antagonist activity against glucocorticoid receptor (unknown origin) expressed in HEK293 cells by GRE-dependent luciferase reporter gene assay
J Med Chem 58: 6607-18 (2015)
BindingDB Entry DOI: 10.7270/Q2ST7RMV
Glucocorticoid receptor
(RAT)
BDBM50110732
(CHEMBL3605927)
Show SMILES COc1cc(F)ccc1-c1c(Cc2ccccc2)[nH]c2c(NS(C)(=O)=O)cc(cc12)C(C)C |(-1,4.66,;-.24,3.69,;1.29,3.91,;1.86,5.34,;3.38,5.55,;3.84,6.7,;4.33,4.34,;3.76,2.91,;2.23,2.7,;1.76,1.24,;2.66,.02,;4.2,.03,;4.98,-1.29,;6.52,-1.28,;7.3,-2.61,;6.54,-3.95,;5,-3.96,;4.22,-2.63,;1.76,-1.24,;.3,-.77,;-1.03,-1.55,;-1.02,-3.09,;-2.35,-3.87,;-3.42,-3.26,;-2.35,-5.1,;-3.42,-4.49,;-2.38,-.77,;-2.38,.77,;-1.03,1.55,;.3,.77,;-3.72,1.53,;-3.72,2.76,;-4.78,.91,)|
Show InChI InChI=1S/C26H27FN2O3S/c1-16(2)18-13-21-25(20-11-10-19(27)15-24(20)32-3)22(12-17-8-6-5-7-9-17)28-26(21)23(14-18)29-33(4,30)31/h5-11,13-16,28-29H,12H2,1-4H3
n/an/a 292n/an/an/an/an/an/a
Eli Lilly Biotechnology Center
Curated by ChEMBL
Assay Description
Antagonist activity against glucocorticoid receptor in rat H4-IIE cells assessed as inhibition of dexamethasone-induced receptor transactivation pre-...
J Med Chem 58: 6607-18 (2015)
BindingDB Entry DOI: 10.7270/Q2ST7RMV