BDBM50110802 9-[4-(Difluoromethyldiphosphonyl)oxyphosphonylmethoxy)-cyclopent-2-enyl]adenine::CHEMBL423477
SMILES: Nc1ncnc2n(cnc12)C1CC(OCP(O)(=O)OP(O)(=O)C(F)(F)P(O)(O)=O)C=C1
InChI Key: InChIKey=QYSNJCSGAITOGQ-UHFFFAOYSA-N
Data: 1 IC50
Activity Spreadsheet -- Enzyme Inhibition Constant Data from BindingDB
Found 1 hit for monomerid = 50110802
Trg + Lig
Ki
nM
ΔG°
kcal/mole
IC50
nM
Kd
nM
EC50/IC50
nM
koff
s-1
kon
M-1s-1
pHTemp
°C
Human immunodeficiency virus type 1 reverse transcriptase
(Human immunodeficiency virus 1)
BDBM50110802
(9-[4-(Difluoromethyldiphosphonyl)oxyphosphonylmeth...)
Show SMILES Nc1ncnc2n(cnc12)C1CC(OCP(O)(=O)OP(O)(=O)C(F)(F)P(O)(O)=O)C=C1 |c:31|
Show InChI InChI=1S/C12H16F2N5O9P3/c13-12(14,30(22,23)24)31(25,26)28-29(20,21)6-27-8-2-1-7(3-8)19-5-18-9-10(15)16-4-17-11(9)19/h1-2,4-5,7-8H,3,6H2,(H,20,21)(H,25,26)(H2,15,16,17)(H2,22,23,24)
n/an/a 2.50E+4n/an/an/an/an/an/a
Russian Academy of Sciences
Curated by ChEMBL
Assay Description
Inhibition of DNA synthesis by HIV reverse transcriptase
J Med Chem 45: 1284-91 (2002)
BindingDB Entry DOI: 10.7270/Q2PR7V9F