BDBM50110804 CHEMBL23358::P,P'-Bis {[4-(adenine-9-yl)cyclopent-2-enyl]oxy-methylphosphonyl}diphosphate
SMILES: Nc1ncnc2n(cnc12)C1CC(OCP(O)(=O)OP(O)(=O)OP(O)(=O)OP(O)(=O)COC2CC(C=C2)n2cnc3c(N)ncnc23)C=C1
InChI Key: InChIKey=FHAGYNIFEVPJDX-UHFFFAOYSA-N
Data: 1 IC50
Activity Spreadsheet -- Enzyme Inhibition Constant Data from BindingDB
Found 1 hit for monomerid = 50110804
Trg + Lig
Ki
nM
ΔG°
kcal/mole
IC50
nM
Kd
nM
EC50/IC50
nM
koff
s-1
kon
M-1s-1
pHTemp
°C
Human immunodeficiency virus type 1 reverse transcriptase
(Human immunodeficiency virus 1)
BDBM50110804
(CHEMBL23358 | P,P'-Bis {[4-(adenine-9-yl)cyclopent...)
Show SMILES Nc1ncnc2n(cnc12)C1CC(OCP(O)(=O)OP(O)(=O)OP(O)(=O)OP(O)(=O)COC2CC(C=C2)n2cnc3c(N)ncnc23)C=C1 |c:37,52|
Show InChI InChI=1S/C22H28N10O13P4/c23-19-17-21(27-7-25-19)31(9-29-17)13-1-3-15(5-13)41-11-46(33,34)43-48(37,38)45-49(39,40)44-47(35,36)12-42-16-4-2-14(6-16)32-10-30-18-20(24)26-8-28-22(18)32/h1-4,7-10,13-16H,5-6,11-12H2,(H,33,34)(H,35,36)(H,37,38)(H,39,40)(H2,23,25,27)(H2,24,26,28)
n/an/a 2.00E+3n/an/an/an/an/an/a
Russian Academy of Sciences
Curated by ChEMBL
Assay Description
Inhibition of DNA synthesis by HIV reverse transcriptase
J Med Chem 45: 1284-91 (2002)
BindingDB Entry DOI: 10.7270/Q2PR7V9F