BDBM50110860 CHEMBL29247::{3-[3-(4-Decyloxy-phenoxy)-2-oxo-propoxy]-phenyl}-acetic acid
SMILES: CCCCCCCCCCOc1ccc(OCC(=O)COc2cccc(CC(O)=O)c2)cc1
InChI Key: InChIKey=DRLWXCITYWBNPM-UHFFFAOYSA-N
Data: 1 IC50
Activity Spreadsheet -- Enzyme Inhibition Constant Data from BindingDB
Found 1 hit for monomerid = 50110860
Trg + Lig
Ki
nM
ΔG°
kcal/mole
IC50
nM
Kd
nM
EC50/IC50
nM
koff
s-1
kon
M-1s-1
pHTemp
°C
Phospholipase A2 group 1VB
(Homo sapiens (Human))
BDBM50110860
(CHEMBL29247 | {3-[3-(4-Decyloxy-phenoxy)-2-oxo-pro...)
Show SMILES CCCCCCCCCCOc1ccc(OCC(=O)COc2cccc(CC(O)=O)c2)cc1
Show InChI InChI=1S/C27H36O6/c1-2-3-4-5-6-7-8-9-17-31-24-13-15-25(16-14-24)32-20-23(28)21-33-26-12-10-11-22(18-26)19-27(29)30/h10-16,18H,2-9,17,19-21H2,1H3,(H,29,30)
Reactome pathway
n/an/a 60n/an/an/an/an/an/a
AstraZeneca R&D Charnwood
Curated by ChEMBL
Assay Description
Inhibitory activity against cytosolic Phospholipase A2 (PLA2) by soluble assay
J Med Chem 45: 1348-62 (2002)
BindingDB Entry DOI: 10.7270/Q2F76BVP