BDBM50110872 4-[3-(4-Decyloxy-phenoxy)-2-oxo-propoxymethyl]-benzoic acid::CHEMBL29353
SMILES: CCCCCCCCCCOc1ccc(OCC(=O)COCc2ccc(cc2)C(O)=O)cc1
InChI Key: InChIKey=PYQGDAJQRYOXQV-UHFFFAOYSA-N
Data: 1 IC50
Activity Spreadsheet -- Enzyme Inhibition Constant Data from BindingDB
Found 1 hit for monomerid = 50110872
Trg + Lig
Ki
nM
ΔG°
kcal/mole
IC50
nM
Kd
nM
EC50/IC50
nM
koff
s-1
kon
M-1s-1
pHTemp
°C
Phospholipase A2 group 1VB
(Homo sapiens (Human))
BDBM50110872
(4-[3-(4-Decyloxy-phenoxy)-2-oxo-propoxymethyl]-ben...)
Show SMILES CCCCCCCCCCOc1ccc(OCC(=O)COCc2ccc(cc2)C(O)=O)cc1
Show InChI InChI=1S/C27H36O6/c1-2-3-4-5-6-7-8-9-18-32-25-14-16-26(17-15-25)33-21-24(28)20-31-19-22-10-12-23(13-11-22)27(29)30/h10-17H,2-9,18-21H2,1H3,(H,29,30)
Reactome pathway
n/an/a 40n/an/an/an/an/an/a
AstraZeneca R&D Charnwood
Curated by ChEMBL
Assay Description
Inhibitory activity against cytosolic Phospholipase A2 (PLA2) by soluble assay
J Med Chem 45: 1348-62 (2002)
BindingDB Entry DOI: 10.7270/Q2F76BVP