BDBM50110873 4-[3-(4-Dodecyloxy-phenoxy)-2-oxo-propoxy]-benzoic acid::CHEMBL418207
SMILES: CCCCCCCCCCCCOc1ccc(OCC(=O)COc2ccc(cc2)C(O)=O)cc1
InChI Key: InChIKey=ABIWFFTUJSYGNO-UHFFFAOYSA-N
Data: 1 IC50
Activity Spreadsheet -- Enzyme Inhibition Constant Data from BindingDB
Found 1 hit for monomerid = 50110873
Trg + Lig
Ki
nM
ΔG°
kcal/mole
IC50
nM
Kd
nM
EC50/IC50
nM
koff
s-1
kon
M-1s-1
pHTemp
°C
Phospholipase A2 group 1VB
(Homo sapiens (Human))
BDBM50110873
(4-[3-(4-Dodecyloxy-phenoxy)-2-oxo-propoxy]-benzoic...)
Show SMILES CCCCCCCCCCCCOc1ccc(OCC(=O)COc2ccc(cc2)C(O)=O)cc1
Show InChI InChI=1S/C28H38O6/c1-2-3-4-5-6-7-8-9-10-11-20-32-25-16-18-27(19-17-25)34-22-24(29)21-33-26-14-12-23(13-15-26)28(30)31/h12-19H,2-11,20-22H2,1H3,(H,30,31)
Reactome pathway
n/an/a 26n/an/an/an/an/an/a
AstraZeneca R&D Charnwood
Curated by ChEMBL
Assay Description
Inhibitory activity against cytosolic Phospholipase A2 (PLA2) by soluble assay
J Med Chem 45: 1348-62 (2002)
BindingDB Entry DOI: 10.7270/Q2F76BVP