BDBM50111423 CHEMBL12631::[1-(2-Pyridin-4-yl-2,8-diaza-spiro[4.5]decane-8-carbonyl)-piperidin-4-yloxy]-acetic acid
SMILES: OC(=O)COC1CCN(CC1)C(=O)N1CCC2(CCN(C2)c2ccncc2)CC1
InChI Key: InChIKey=AXUWUSOLQCOXEX-UHFFFAOYSA-N
Data: 1 IC50
Activity Spreadsheet -- Enzyme Inhibition Constant Data from BindingDB
Found 1 hit for monomerid = 50111423
Trg + Lig
Ki
nM
ΔG°
kcal/mole
IC50
nM
Kd
nM
EC50/IC50
nM
koff
s-1
kon
M-1s-1
pHTemp
°C
Integrin alpha-IIb/beta-3
(Homo sapiens (Human))
BDBM50111423
(CHEMBL12631 | [1-(2-Pyridin-4-yl-2,8-diaza-spiro[4...)
Show SMILES OC(=O)COC1CCN(CC1)C(=O)N1CCC2(CCN(C2)c2ccncc2)CC1
Show InChI InChI=1S/C21H30N4O4/c26-19(27)15-29-18-3-10-23(11-4-18)20(28)24-12-5-21(6-13-24)7-14-25(16-21)17-1-8-22-9-2-17/h1-2,8-9,18H,3-7,10-16H2,(H,26,27)
n/an/a 138n/an/an/an/an/an/a
COR Therapeutics, Inc.
Curated by ChEMBL
Assay Description
In vitro activity to block the binding of fibrinogen to purified human fibrinogen receptor.
Bioorg Med Chem Lett 12: 1103-7 (2002)
BindingDB Entry DOI: 10.7270/Q2H131BN