BDBM50111514 CHEMBL3605048
SMILES: COc1cc(cc(O)c1-c1cc(Cl)cc(Cl)c1)C(=O)c1ccc(C)cc1
InChI Key: InChIKey=YKZWHKWGSHQUSU-UHFFFAOYSA-N
Data: 2 KI  1 EC50
Activity Spreadsheet -- Enzyme Inhibition Constant Data from BindingDB
Found 3 hits for monomerid = 50111514
Trg + Lig
Ki
nM
ΔG°
kcal/mole
IC50
nM
Kd
nM
EC50/IC50
nM
koff
s-1
kon
M-1s-1
pHTemp
°C
Cannabinoid receptor 2
(Homo sapiens (Human))
BDBM50111514
(CHEMBL3605048)
Show SMILES COc1cc(cc(O)c1-c1cc(Cl)cc(Cl)c1)C(=O)c1ccc(C)cc1
Show InChI InChI=1S/C21H16Cl2O3/c1-12-3-5-13(6-4-12)21(25)15-9-18(24)20(19(10-15)26-2)14-7-16(22)11-17(23)8-14/h3-11,24H,1-2H3
Reactome pathway
>1.00E+4n/an/an/an/an/an/an/an/a
University of Tennessee Health Science Center
Curated by ChEMBL
Assay Description
Displacement of [3H]-CP55940 from CB2 receptor (unknown origin) expressed in CHO cell membranes after 90 mins by liquid scintillation counting analys...
Bioorg Med Chem 23: 5390-401 (2015)
BindingDB Entry DOI: 10.7270/Q2HD7XF2
Cannabinoid receptor 1
(Homo sapiens (Human))
BDBM50111514
(CHEMBL3605048)
Show SMILES COc1cc(cc(O)c1-c1cc(Cl)cc(Cl)c1)C(=O)c1ccc(C)cc1
Show InChI InChI=1S/C21H16Cl2O3/c1-12-3-5-13(6-4-12)21(25)15-9-18(24)20(19(10-15)26-2)14-7-16(22)11-17(23)8-14/h3-11,24H,1-2H3
NCI pathway
Reactome pathway
>1.00E+4n/an/an/an/an/an/an/an/a
University of Tennessee Health Science Center
Curated by ChEMBL
Assay Description
Displacement of [3H]-CP55940 from CB1 receptor (unknown origin) expressed in CHO cell membranes after 90 mins by liquid scintillation counting analys...
Bioorg Med Chem 23: 5390-401 (2015)
BindingDB Entry DOI: 10.7270/Q2HD7XF2
Cannabinoid receptor 2
(Homo sapiens (Human))
BDBM50111514
(CHEMBL3605048)
Show SMILES COc1cc(cc(O)c1-c1cc(Cl)cc(Cl)c1)C(=O)c1ccc(C)cc1
Show InChI InChI=1S/C21H16Cl2O3/c1-12-3-5-13(6-4-12)21(25)15-9-18(24)20(19(10-15)26-2)14-7-16(22)11-17(23)8-14/h3-11,24H,1-2H3
Reactome pathway
n/an/an/an/a>5.00E+3n/an/an/an/a
University of Tennessee Health Science Center
Curated by ChEMBL
Assay Description
Inverse agonist activity at CB2 receptor (unknown origin) expressed in HEK cells assessed as increase in cAMP production measured at 50 mins by ACTOn...
Bioorg Med Chem 23: 5390-401 (2015)
BindingDB Entry DOI: 10.7270/Q2HD7XF2