BDBM50111516 CHEMBL3605050
SMILES: COc1cc(cc(O)c1-c1cc(Cl)cc(Cl)c1)C(=O)c1ccc(Cl)cc1
InChI Key: InChIKey=TVDQBXVJUFSQLL-UHFFFAOYSA-N
Data: 2 KI  2 EC50
Activity Spreadsheet -- Enzyme Inhibition Constant Data from BindingDB
Found 4 hits for monomerid = 50111516
Trg + Lig
Ki
nM
ΔG°
kcal/mole
IC50
nM
Kd
nM
EC50/IC50
nM
koff
s-1
kon
M-1s-1
pHTemp
°C
Cannabinoid receptor 2
(Homo sapiens (Human))
BDBM50111516
(CHEMBL3605050)
Show SMILES COc1cc(cc(O)c1-c1cc(Cl)cc(Cl)c1)C(=O)c1ccc(Cl)cc1
Show InChI InChI=1S/C20H13Cl3O3/c1-26-18-9-13(20(25)11-2-4-14(21)5-3-11)8-17(24)19(18)12-6-15(22)10-16(23)7-12/h2-10,24H,1H3
Reactome pathway
>1.00E+4n/an/an/an/an/an/an/an/a
University of Tennessee Health Science Center
Curated by ChEMBL
Assay Description
Displacement of [3H]-CP55940 from CB2 receptor (unknown origin) expressed in CHO cell membranes after 90 mins by liquid scintillation counting analys...
Bioorg Med Chem 23: 5390-401 (2015)
BindingDB Entry DOI: 10.7270/Q2HD7XF2
Cannabinoid receptor 1
(Homo sapiens (Human))
BDBM50111516
(CHEMBL3605050)
Show SMILES COc1cc(cc(O)c1-c1cc(Cl)cc(Cl)c1)C(=O)c1ccc(Cl)cc1
Show InChI InChI=1S/C20H13Cl3O3/c1-26-18-9-13(20(25)11-2-4-14(21)5-3-11)8-17(24)19(18)12-6-15(22)10-16(23)7-12/h2-10,24H,1H3
NCI pathway
Reactome pathway
>1.00E+4n/an/an/an/an/an/an/an/a
University of Tennessee Health Science Center
Curated by ChEMBL
Assay Description
Displacement of [3H]-CP55940 from CB1 receptor (unknown origin) expressed in CHO cell membranes after 90 mins by liquid scintillation counting analys...
Bioorg Med Chem 23: 5390-401 (2015)
BindingDB Entry DOI: 10.7270/Q2HD7XF2
Cannabinoid receptor 1
(Homo sapiens (Human))
BDBM50111516
(CHEMBL3605050)
Show SMILES COc1cc(cc(O)c1-c1cc(Cl)cc(Cl)c1)C(=O)c1ccc(Cl)cc1
Show InChI InChI=1S/C20H13Cl3O3/c1-26-18-9-13(20(25)11-2-4-14(21)5-3-11)8-17(24)19(18)12-6-15(22)10-16(23)7-12/h2-10,24H,1H3
NCI pathway
Reactome pathway
n/an/an/an/a 2.88E+3n/an/an/an/a
University of Tennessee Health Science Center
Curated by ChEMBL
Assay Description
Inverse agonist activity at CB1 receptor (unknown origin) expressed in HEK cells assessed as increase in cAMP production measured at 50 mins by ACTOn...
Bioorg Med Chem 23: 5390-401 (2015)
BindingDB Entry DOI: 10.7270/Q2HD7XF2
Cannabinoid receptor 2
(Homo sapiens (Human))
BDBM50111516
(CHEMBL3605050)
Show SMILES COc1cc(cc(O)c1-c1cc(Cl)cc(Cl)c1)C(=O)c1ccc(Cl)cc1
Show InChI InChI=1S/C20H13Cl3O3/c1-26-18-9-13(20(25)11-2-4-14(21)5-3-11)8-17(24)19(18)12-6-15(22)10-16(23)7-12/h2-10,24H,1H3
Reactome pathway
n/an/an/an/a>5.00E+3n/an/an/an/a
University of Tennessee Health Science Center
Curated by ChEMBL
Assay Description
Inverse agonist activity at CB2 receptor (unknown origin) expressed in HEK cells assessed as increase in cAMP production measured at 50 mins by ACTOn...
Bioorg Med Chem 23: 5390-401 (2015)
BindingDB Entry DOI: 10.7270/Q2HD7XF2