BDBM50111639 CHEMBL16184::N-[(S)-1-(7-Amino-heptylcarbamoyl)-2-(4-hydroxy-phenyl)-ethyl]-butyramide
SMILES: CCCC(=O)N[C@@H](Cc1ccc(O)cc1)C(=O)NCCCCCCCN
InChI Key: InChIKey=XKOIBCCSEZNHCT-SFHVURJKSA-N
Data: 2 IC50
Activity Spreadsheet -- Enzyme Inhibition Constant Data from BindingDB
Found 2 hits for monomerid = 50111639
Trg + Lig
Ki
nM
ΔG°
kcal/mole
IC50
nM
Kd
nM
EC50/IC50
nM
koff
s-1
kon
M-1s-1
pHTemp
°C
Muscle-type nicotinic acetylcholine receptor
(Homo sapiens (Human))
BDBM50111639
(CHEMBL16184 | N-[(S)-1-(7-Amino-heptylcarbamoyl)-2...)
Show SMILES CCCC(=O)N[C@@H](Cc1ccc(O)cc1)C(=O)NCCCCCCCN
Show InChI InChI=1S/C20H33N3O3/c1-2-8-19(25)23-18(15-16-9-11-17(24)12-10-16)20(26)22-14-7-5-3-4-6-13-21/h9-12,18,24H,2-8,13-15,21H2,1H3,(H,22,26)(H,23,25)/t18-/m0/s1
Reactome pathway
n/an/a 5.44E+3n/an/an/an/an/an/a
The Royal Danish School of Pharmacy
Curated by ChEMBL
Assay Description
Compound was evaluated for inhibitory activity against human embryonic muscle type Nicotinic acetylcholine receptor specifically delta-subunit expres...
Bioorg Med Chem Lett 12: 1159-62 (2002)
BindingDB Entry DOI: 10.7270/Q2BC3XWG
Muscle-type nicotinic acetylcholine receptor
(Homo sapiens (Human))
BDBM50111639
(CHEMBL16184 | N-[(S)-1-(7-Amino-heptylcarbamoyl)-2...)
Show SMILES CCCC(=O)N[C@@H](Cc1ccc(O)cc1)C(=O)NCCCCCCCN
Show InChI InChI=1S/C20H33N3O3/c1-2-8-19(25)23-18(15-16-9-11-17(24)12-10-16)20(26)22-14-7-5-3-4-6-13-21/h9-12,18,24H,2-8,13-15,21H2,1H3,(H,22,26)(H,23,25)/t18-/m0/s1
Reactome pathway
n/an/a 1.05E+4n/an/an/an/an/an/a
The Royal Danish School of Pharmacy
Curated by ChEMBL
Assay Description
Compound was evaluated for inhibitory activity against human embryonic muscle type Nicotinic acetylcholine receptor specifically delta-subunit expres...
Bioorg Med Chem Lett 12: 1159-62 (2002)
BindingDB Entry DOI: 10.7270/Q2BC3XWG