BDBM50111779 CHEMBL3605364
SMILES: [I-].[I-].OCC[n+]1ccc2n(CCCCCCCCCn3c4ccccc4c4c[n+](CCO)ccc34)c3ccccc3c2c1
InChI Key: InChIKey=NZSSUHPFQJXYCA-WBSGOERWSA-N
Data: 4 IC50
Activity Spreadsheet -- Enzyme Inhibition Constant Data from BindingDB
Found 4 hits for monomerid = 50111779
Trg + Lig
Ki
nM
ΔG°
kcal/mole
IC50
nM
Kd
nM
EC50/IC50
nM
koff
s-1
kon
M-1s-1
pHTemp
°C
Amine oxidase (flavin-containing) A
(Homo sapiens (Human))
BDBM50111779
(CHEMBL3605364)
Show SMILES [I-].[I-].OCC[n+]1ccc2n(CCCCCCCCCn3c4ccccc4c4c[n+](CCO)ccc34)c3ccccc3c2c1
Show InChI InChI=1S/C29H52N4O8/c1-2-3-4-5-6-7-8-9-10-11-12-13-15-31-19-23(41-28-26(37)25(36)22(18-30)40-28)21-17-20(34)27(39-21)33-16-14-24(35)32-29(33)38/h14,16,20-23,25-28,31,34,36-37H,2-13,15,17-19,30H2,1H3,(H,32,35,38)/t20-,21+,22-,23+,25-,26-,27-,28+/m1/s1
n/an/a 1.46E+4n/an/an/an/an/an/a
University of Jena
Curated by ChEMBL
Assay Description
Inhibition of human recombinant MAOA
J Med Chem 58: 6710-5 (2015)
BindingDB Entry DOI: 10.7270/Q2QZ2CRZ
Acetylcholinesterase
(Electrophorus electricus (Electric eel))
BDBM50111779
(CHEMBL3605364)
Show SMILES [I-].[I-].OCC[n+]1ccc2n(CCCCCCCCCn3c4ccccc4c4c[n+](CCO)ccc34)c3ccccc3c2c1
Show InChI InChI=1S/C29H52N4O8/c1-2-3-4-5-6-7-8-9-10-11-12-13-15-31-19-23(41-28-26(37)25(36)22(18-30)40-28)21-17-20(34)27(39-21)33-16-14-24(35)32-29(33)38/h14,16,20-23,25-28,31,34,36-37H,2-13,15,17-19,30H2,1H3,(H,32,35,38)/t20-,21+,22-,23+,25-,26-,27-,28+/m1/s1
n/an/a 7.20n/an/an/an/an/an/a
University of Jena
Curated by ChEMBL
Assay Description
Inhibition of electric eel AChE using acetylthiocholine iodide substrate by Ellman assay
J Med Chem 58: 6710-5 (2015)
BindingDB Entry DOI: 10.7270/Q2QZ2CRZ
Butyrylcholinesterase (BuChE)
(Equus caballus (Horse))
BDBM50111779
(CHEMBL3605364)
Show SMILES [I-].[I-].OCC[n+]1ccc2n(CCCCCCCCCn3c4ccccc4c4c[n+](CCO)ccc34)c3ccccc3c2c1
Show InChI InChI=1S/C29H52N4O8/c1-2-3-4-5-6-7-8-9-10-11-12-13-15-31-19-23(41-28-26(37)25(36)22(18-30)40-28)21-17-20(34)27(39-21)33-16-14-24(35)32-29(33)38/h14,16,20-23,25-28,31,34,36-37H,2-13,15,17-19,30H2,1H3,(H,32,35,38)/t20-,21+,22-,23+,25-,26-,27-,28+/m1/s1
n/an/a 85n/an/an/an/an/an/a
University of Jena
Curated by ChEMBL
Assay Description
Inhibition of BChE in equine serum using butyrylthiocholine iodide substrate by Ellman assay
J Med Chem 58: 6710-5 (2015)
BindingDB Entry DOI: 10.7270/Q2QZ2CRZ
Amine oxidase [flavin-containing] B
(Homo sapiens (Human))
BDBM50111779
(CHEMBL3605364)
Show SMILES [I-].[I-].OCC[n+]1ccc2n(CCCCCCCCCn3c4ccccc4c4c[n+](CCO)ccc34)c3ccccc3c2c1
Show InChI InChI=1S/C29H52N4O8/c1-2-3-4-5-6-7-8-9-10-11-12-13-15-31-19-23(41-28-26(37)25(36)22(18-30)40-28)21-17-20(34)27(39-21)33-16-14-24(35)32-29(33)38/h14,16,20-23,25-28,31,34,36-37H,2-13,15,17-19,30H2,1H3,(H,32,35,38)/t20-,21+,22-,23+,25-,26-,27-,28+/m1/s1
n/an/a 2.31E+4n/an/an/an/an/an/a
University of Jena
Curated by ChEMBL
Assay Description
Inhibition of human recombinant MAOB
J Med Chem 58: 6710-5 (2015)
BindingDB Entry DOI: 10.7270/Q2QZ2CRZ