BDBM50111977 1-adamantanecarboxylate (AC)::Adamantane-1-carboxylic acid::CHEMBL170568
SMILES: [H]C12CC3([H])CC([H])(C1)CC(C2)(C3)C(O)=O
InChI Key: InChIKey=JIMXXGFJRDUSRO-UHFFFAOYSA-N
Data: 7 ITC
Activity Spreadsheet -- ITC Data from BindingDB
Found 7 hits for monomerid = 50111977
Cell (A)Syringe (B)Cell
Syringe
Cell + Syr
ΔG°
kcal/mole
-TΔS°
kcal/mole
ΔH°
kcal/mole
log KpHTemp
°C
BDBM11
JPEG
BDBM50111977
JPEG
n/a-0.926-4.854.268.525
University of Mississippi
J Am Chem Soc 111: 6765-72 (1989)
BDBM11
JPEG
BDBM50111977
JPEG
n/a-0.862-5.404.607.2025
University of Mississippi
J Am Chem Soc 111: 6765-72 (1989)
BDBM11
JPEG
BDBM50111977
JPEG
n/a0.0926-7.535.484.0525
University of Mississippi
J Am Chem Soc 111: 6765-72 (1989)
BDBM4
JPEG
BDBM50111977
JPEG
n/a0.299-3.202.158.525
University of Mississippi
J Am Chem Soc 111: 6765-72 (1989)
BDBM4
JPEG
BDBM50111977
JPEG
n/a-0.0926-3.102.347.2025
University of Mississippi
J Am Chem Soc 111: 6765-72 (1989)
BDBM4
JPEG
BDBM50111977
JPEG
n/a0.328-3.202.114.0525
University of Mississippi
J Am Chem Soc 111: 6765-72 (1989)
BDBM4
JPEG
BDBM50111977
JPEG
n/a5.25-8.792.624.0525
University of Mississippi
J Am Chem Soc 111: 6765-72 (1989)