BDBM50112210 3-(2-Bromo-2-chloro-1,1-difluoro-ethyl)-3H-diazirine::CHEMBL56298
SMILES:
InChI Key: InChIKey=VLLPOYNQVHHILJ-UHFFFAOYSA-N
Data: 1 IC50
Activity Spreadsheet -- Enzyme Inhibition Constant Data from BindingDB
Found 1 hit for monomerid = 50112210
Trg + Lig
Ki
nM
ΔG°
kcal/mole
IC50
nM
Kd
nM
EC50/IC50
nM
koff
s-1
kon
M-1s-1
pHTemp
°C
Albumin
(Homo sapiens (Human))
BDBM50112210
(3-(2-Bromo-2-chloro-1,1-difluoro-ethyl)-3H-diaziri...)
Show InChI InChI=1S/C3H2BrClF2N2/c4-1(5)3(6,7)2-8-9-2/h1-2H
NCI pathway
Reactome pathway
n/an/a 8.00E+5n/an/an/an/an/an/a
University of Pennsylvania Health System
Curated by ChEMBL
Assay Description
Inhibitory concentration of the compound bound to tryptophan containing region of Serum albumin in fluorescence quenching
J Med Chem 45: 1879-86 (2002)
BindingDB Entry DOI: 10.7270/Q2QF8S79