BDBM50112211 3-(2-Chloro-1,1,2-trifluoro-ethyl)-3-fluoro-3H-diazirine::CHEMBL55478
SMILES:
InChI Key: InChIKey=BDGAMUAUJCKUDJ-UHFFFAOYSA-N
Data: 1 IC50
Activity Spreadsheet -- Enzyme Inhibition Constant Data from BindingDB
Found 1 hit for monomerid = 50112211
Trg + Lig
Ki
nM
ΔG°
kcal/mole
IC50
nM
Kd
nM
EC50/IC50
nM
koff
s-1
kon
M-1s-1
pHTemp
°C
Albumin
(Homo sapiens (Human))
BDBM50112211
(3-(2-Chloro-1,1,2-trifluoro-ethyl)-3-fluoro-3H-dia...)
Show InChI InChI=1S/C3HClF4N2/c4-1(5)2(6,7)3(8)9-10-3/h1H
NCI pathway
Reactome pathway
n/an/a 2.20E+6n/an/an/an/an/an/a
University of Pennsylvania Health System
Curated by ChEMBL
Assay Description
Inhibitory concentration of the compound bound to tryptophan containing region of Serum albumin in fluorescence quenching
J Med Chem 45: 1879-86 (2002)
BindingDB Entry DOI: 10.7270/Q2QF8S79