BDBM50112344 CHEMBL3609314
SMILES: CC[C@H]1N(C2CCCC2)c2nc(Nc3ccc(cc3OC3CCCC3)C(=O)NC3CCN(C)CC3)ncc2N(C)C1=O
InChI Key: InChIKey=OTKIKJDBYKBEOE-AREMUKBSSA-N
Data: 2 KI  2 IC50
Activity Spreadsheet -- Enzyme Inhibition Constant Data from BindingDB
Found 4 hits for monomerid = 50112344
Trg + Lig
Ki
nM
ΔG°
kcal/mole
IC50
nM
Kd
nM
EC50/IC50
nM
koff
s-1
kon
M-1s-1
pHTemp
°C
Serine/threonine-protein kinase PLK1
(Homo sapiens (Human))
BDBM50112344
(CHEMBL3609314)
Show SMILES CC[C@H]1N(C2CCCC2)c2nc(Nc3ccc(cc3OC3CCCC3)C(=O)NC3CCN(C)CC3)ncc2N(C)C1=O |r|
Show InChI InChI=1S/C32H45N7O3/c1-4-26-31(41)38(3)27-20-33-32(36-29(27)39(26)23-9-5-6-10-23)35-25-14-13-21(19-28(25)42-24-11-7-8-12-24)30(40)34-22-15-17-37(2)18-16-22/h13-14,19-20,22-24,26H,4-12,15-18H2,1-3H3,(H,34,40)(H,33,35,36)/t26-/m1/s1
NCI pathway
Reactome pathway
0.840n/an/an/an/an/an/an/an/a
University of Maryland
Curated by ChEMBL
Assay Description
Binding affinity to PLK1 (unknown origin) expressed in HEK293 cells after 1 hr by proprietary competition assay
ACS Med Chem Lett 6: 764-9 (2015)
BindingDB Entry DOI: 10.7270/Q2FF3V4D
Bromodomain-containing protein 4
(Homo sapiens (Human))
BDBM50112344
(CHEMBL3609314)
Show SMILES CC[C@H]1N(C2CCCC2)c2nc(Nc3ccc(cc3OC3CCCC3)C(=O)NC3CCN(C)CC3)ncc2N(C)C1=O |r|
Show InChI InChI=1S/C32H45N7O3/c1-4-26-31(41)38(3)27-20-33-32(36-29(27)39(26)23-9-5-6-10-23)35-25-14-13-21(19-28(25)42-24-11-7-8-12-24)30(40)34-22-15-17-37(2)18-16-22/h13-14,19-20,22-24,26H,4-12,15-18H2,1-3H3,(H,34,40)(H,33,35,36)/t26-/m1/s1
27n/an/an/an/an/an/an/an/a
University of Maryland
Curated by ChEMBL
Assay Description
Binding affinity to BRD4 (unknown origin) expressed in Escherichia coli BL21 after 1 hr by proprietary competition assay
ACS Med Chem Lett 6: 764-9 (2015)
BindingDB Entry DOI: 10.7270/Q2FF3V4D
Bromodomain-containing protein 4
(Homo sapiens (Human))
BDBM50112344
(CHEMBL3609314)
Show SMILES CC[C@H]1N(C2CCCC2)c2nc(Nc3ccc(cc3OC3CCCC3)C(=O)NC3CCN(C)CC3)ncc2N(C)C1=O |r|
Show InChI InChI=1S/C32H45N7O3/c1-4-26-31(41)38(3)27-20-33-32(36-29(27)39(26)23-9-5-6-10-23)35-25-14-13-21(19-28(25)42-24-11-7-8-12-24)30(40)34-22-15-17-37(2)18-16-22/h13-14,19-20,22-24,26H,4-12,15-18H2,1-3H3,(H,34,40)(H,33,35,36)/t26-/m1/s1
n/an/a 33n/an/an/an/an/an/a
Dana Farber Cancer Institute
Curated by ChEMBL
Assay Description
Displacement of Bio-JQ1 from recombinant human His6 tagged BRD4 bromodomain 1 by alphascreen assay
ACS Med Chem Lett 10: 1443-1449 (2019)
Article DOI: 10.1021/acsmedchemlett.9b00243
Transcription initiation factor TFIID subunit 1
(Homo sapiens (Human))
BDBM50112344
(CHEMBL3609314)
Show SMILES CC[C@H]1N(C2CCCC2)c2nc(Nc3ccc(cc3OC3CCCC3)C(=O)NC3CCN(C)CC3)ncc2N(C)C1=O |r|
Show InChI InChI=1S/C32H45N7O3/c1-4-26-31(41)38(3)27-20-33-32(36-29(27)39(26)23-9-5-6-10-23)35-25-14-13-21(19-28(25)42-24-11-7-8-12-24)30(40)34-22-15-17-37(2)18-16-22/h13-14,19-20,22-24,26H,4-12,15-18H2,1-3H3,(H,34,40)(H,33,35,36)/t26-/m1/s1
n/an/a 100n/an/an/an/an/an/a
Dana Farber Cancer Institute
Curated by ChEMBL
Assay Description
Displacement of biotinylated probe from human TAF1 bromodomain 2 (1522 to 1656 residues) expressed in Escherichia coli BL21 (DE3) by alphascreen assa...
ACS Med Chem Lett 10: 1443-1449 (2019)
Article DOI: 10.1021/acsmedchemlett.9b00243