null
SMILES: Cc1cc(NC(=O)Cc2ccc(cc2)S(C)(=O)=O)ccc1-c1ccc(Cl)cc1OC(F)(F)F
InChI Key: InChIKey=MCLXSSCQIXWMBR-UHFFFAOYSA-N
Activity Spreadsheet -- Enzyme Inhibition Constant Data from BindingDB
Found 1 hit for monomerid = 50112361
Trg + Lig
Ki
nM
ΔG°
kcal/mole
IC50
nM
Kd
nM
EC50/IC50
nM
koff
s-1
kon
M-1s-1
pHTemp
°C
Nuclear receptor ROR-gamma
(Homo sapiens (Human))
BDBM50112361
(CHEMBL3609413)
Show SMILES Cc1cc(NC(=O)Cc2ccc(cc2)S(C)(=O)=O)ccc1-c1ccc(Cl)cc1OC(F)(F)F
Show InChI InChI=1S/C23H19ClF3NO4S/c1-14-11-17(28-22(29)12-15-3-7-18(8-4-15)33(2,30)31)6-10-19(14)20-9-5-16(24)13-21(20)32-23(25,26)27/h3-11,13H,12H2,1-2H3,(H,28,29)
n/an/a 6.30n/an/an/an/an/an/a
Fudan University
Curated by ChEMBL
Assay Description
Inhibition of RORgammat (unknown origin) assessed as inhibition of agonist-induced response by FRET assay
ACS Med Chem Lett 6: 787-92 (2015)
BindingDB Entry DOI: 10.7270/Q2XG9SWD