BDBM50112376 1-(3-Chloro-phenyl)-4-{3-[6-(4-trifluoromethyl-phenyl)-pyridin-3-ylmethyl]-3H-imidazol-4-ylmethyl}-piperazin-2-one::CHEMBL23163
SMILES: FC(F)(F)c1ccc(cc1)-c1ccc(Cn2cncc2CN2CCN(C(=O)C2)c2cccc(Cl)c2)cn1
InChI Key: InChIKey=PUIQBGZLGGGFGO-UHFFFAOYSA-N
Data: 3 IC50
Activity Spreadsheet -- Enzyme Inhibition Constant Data from BindingDB
Found 3 hits for monomerid = 50112376
Trg + Lig
Ki
nM
ΔG°
kcal/mole
IC50
nM
Kd
nM
EC50/IC50
nM
koff
s-1
kon
M-1s-1
pHTemp
°C
Protein Farnesyltransferase (PFT)
(Bos taurus (bovine))
BDBM50112376
(1-(3-Chloro-phenyl)-4-{3-[6-(4-trifluoromethyl-phe...)
Show SMILES FC(F)(F)c1ccc(cc1)-c1ccc(Cn2cncc2CN2CCN(C(=O)C2)c2cccc(Cl)c2)cn1
Show InChI InChI=1S/C27H23ClF3N5O/c28-22-2-1-3-23(12-22)36-11-10-34(17-26(36)37)16-24-14-32-18-35(24)15-19-4-9-25(33-13-19)20-5-7-21(8-6-20)27(29,30)31/h1-9,12-14,18H,10-11,15-17H2
n/an/a 159n/an/an/an/an/an/a
Merck Research Laboratories
Curated by ChEMBL
Assay Description
Inhibition of Farnesyltransferase catalyzed incorporation of [3H]-FPP into recombinant Ras-CVIM.
Bioorg Med Chem Lett 12: 1269-73 (2002)
BindingDB Entry DOI: 10.7270/Q2T72GSB
Geranylgeranyl transferase type I beta subunit/Protein Farnesyltransferase (PFT)
(Homo sapiens (Human))
BDBM50112376
(1-(3-Chloro-phenyl)-4-{3-[6-(4-trifluoromethyl-phe...)
Show SMILES FC(F)(F)c1ccc(cc1)-c1ccc(Cn2cncc2CN2CCN(C(=O)C2)c2cccc(Cl)c2)cn1
Show InChI InChI=1S/C27H23ClF3N5O/c28-22-2-1-3-23(12-22)36-11-10-34(17-26(36)37)16-24-14-32-18-35(24)15-19-4-9-25(33-13-19)20-5-7-21(8-6-20)27(29,30)31/h1-9,12-14,18H,10-11,15-17H2
n/an/a 509n/an/an/an/an/an/a
Merck Research Laboratories
Curated by ChEMBL
Assay Description
Displacement of radiolabeled FTI from Farnesyltransferase in v-Ha-ras-transformed Rat1 cells.
Bioorg Med Chem Lett 12: 1269-73 (2002)
BindingDB Entry DOI: 10.7270/Q2T72GSB
Protein Farnesyltransferase (PFT)
(Bos taurus (bovine))
BDBM50112376
(1-(3-Chloro-phenyl)-4-{3-[6-(4-trifluoromethyl-phe...)
Show SMILES FC(F)(F)c1ccc(cc1)-c1ccc(Cn2cncc2CN2CCN(C(=O)C2)c2cccc(Cl)c2)cn1
Show InChI InChI=1S/C27H23ClF3N5O/c28-22-2-1-3-23(12-22)36-11-10-34(17-26(36)37)16-24-14-32-18-35(24)15-19-4-9-25(33-13-19)20-5-7-21(8-6-20)27(29,30)31/h1-9,12-14,18H,10-11,15-17H2
n/an/a 14n/an/an/an/an/an/a
Merck Research Laboratories
Curated by ChEMBL
Assay Description
Inhibition of Farnesyltransferase catalyzed incorporation of [3H]-FPP into recombinant Ras-CVIM.
Bioorg Med Chem Lett 12: 1269-73 (2002)
BindingDB Entry DOI: 10.7270/Q2T72GSB