BDBM50112391 1-(3-Chloro-phenyl)-4-{3-[6-(4-trifluoromethoxy-phenyl)-pyridin-3-ylmethyl]-3H-imidazol-4-ylmethyl}-piperazin-2-one::CHEMBL23219
SMILES: FC(F)(F)Oc1ccc(cc1)-c1ccc(Cn2cncc2CN2CCN(C(=O)C2)c2cccc(Cl)c2)cn1
InChI Key: InChIKey=UUVHQULSIKGMES-UHFFFAOYSA-N
Data: 2 IC50
Activity Spreadsheet -- Enzyme Inhibition Constant Data from BindingDB
Found 2 hits for monomerid = 50112391
Trg + Lig
Ki
nM
ΔG°
kcal/mole
IC50
nM
Kd
nM
EC50/IC50
nM
koff
s-1
kon
M-1s-1
pHTemp
°C
Geranylgeranyl transferase type-1 subunit beta/Protein farnesyltransferase/geranylgeranyltransferase type-1 subunit alpha
(Homo sapiens (Human))
BDBM50112391
(1-(3-Chloro-phenyl)-4-{3-[6-(4-trifluoromethoxy-ph...)
Show SMILES FC(F)(F)Oc1ccc(cc1)-c1ccc(Cn2cncc2CN2CCN(C(=O)C2)c2cccc(Cl)c2)cn1
Show InChI InChI=1S/C27H23ClF3N5O2/c28-21-2-1-3-22(12-21)36-11-10-34(17-26(36)37)16-23-14-32-18-35(23)15-19-4-9-25(33-13-19)20-5-7-24(8-6-20)38-27(29,30)31/h1-9,12-14,18H,10-11,15-17H2
n/an/a 560n/an/an/an/an/an/a
Merck Research Laboratories
Curated by ChEMBL
Assay Description
Inhibition of Farnesyltransferase catalyzed incorporation of [3H]-FPP into recombinant Ras-CVIM.
Bioorg Med Chem Lett 12: 1269-73 (2002)
BindingDB Entry DOI: 10.7270/Q2T72GSB
Protein farnesyltransferase subunit beta/geranylgeranyltransferase type-1 subunit alpha
(Bos taurus (bovine))
BDBM50112391
(1-(3-Chloro-phenyl)-4-{3-[6-(4-trifluoromethoxy-ph...)
Show SMILES FC(F)(F)Oc1ccc(cc1)-c1ccc(Cn2cncc2CN2CCN(C(=O)C2)c2cccc(Cl)c2)cn1
Show InChI InChI=1S/C27H23ClF3N5O2/c28-21-2-1-3-22(12-21)36-11-10-34(17-26(36)37)16-23-14-32-18-35(23)15-19-4-9-25(33-13-19)20-5-7-24(8-6-20)38-27(29,30)31/h1-9,12-14,18H,10-11,15-17H2
n/an/a 52n/an/an/an/an/an/a
Merck Research Laboratories
Curated by ChEMBL
Assay Description
Inhibition of Farnesyltransferase catalyzed incorporation of [3H]-FPP into recombinant Ras-CVIM.
Bioorg Med Chem Lett 12: 1269-73 (2002)
BindingDB Entry DOI: 10.7270/Q2T72GSB