BDBM50112615 CHEMBL3608785
SMILES: Cc1ccc(CNC(=O)Nc2ccccc2)cc1NC(=O)c1cnc2ccccn12
InChI Key: InChIKey=JHKCROCKUJZVRL-UHFFFAOYSA-N
Data: 2 IC50
Activity Spreadsheet -- Enzyme Inhibition Constant Data from BindingDB
Found 2 hits for monomerid = 50112615
Trg + Lig
Ki
nM
ΔG°
kcal/mole
IC50
nM
Kd
nM
EC50/IC50
nM
koff
s-1
kon
M-1s-1
pHTemp
°C
Mast/stem cell growth factor receptor Kit
(Homo sapiens (Human))
BDBM50112615
(CHEMBL3608785)
Show SMILES Cc1ccc(CNC(=O)Nc2ccccc2)cc1NC(=O)c1cnc2ccccn12
Show InChI InChI=1S/C23H21N5O2/c1-16-10-11-17(14-25-23(30)26-18-7-3-2-4-8-18)13-19(16)27-22(29)20-15-24-21-9-5-6-12-28(20)21/h2-13,15H,14H2,1H3,(H,27,29)(H2,25,26,30)
n/an/a 9.80n/an/an/an/an/an/a
Astex Pharmaceuticals
Curated by ChEMBL
Assay Description
Inhibition of c-Kit (unknown origin) using biotinylated HER2 peptide as substrate by time resolved fluorescence method
ACS Med Chem Lett 6: 798-803 (2015)
BindingDB Entry DOI: 10.7270/Q2SQ925G
Discoidin domain-containing receptor 2
(Homo sapiens (Human))
BDBM50112615
(CHEMBL3608785)
Show SMILES Cc1ccc(CNC(=O)Nc2ccccc2)cc1NC(=O)c1cnc2ccccn12
Show InChI InChI=1S/C23H21N5O2/c1-16-10-11-17(14-25-23(30)26-18-7-3-2-4-8-18)13-19(16)27-22(29)20-15-24-21-9-5-6-12-28(20)21/h2-13,15H,14H2,1H3,(H,27,29)(H2,25,26,30)
Reactome pathway
n/an/a 8.20n/an/an/an/an/an/a
Astex Pharmaceuticals
Curated by ChEMBL
Assay Description
Inhibition of DDR2 (unknown origin) after 1 hr by time resolved fluorescence method
ACS Med Chem Lett 6: 798-803 (2015)
BindingDB Entry DOI: 10.7270/Q2SQ925G