BDBM50112620 (epsilon-FITC-K-G-S-G-Q-W-A-V-G-H-L-M-NH2)::CHEMBL268103
SMILES: CSCCC(NC(=O)C(CC(C)C)NC(=O)C(Cc1cnc[nH]1)NC(=O)CNC(=O)C(NC(=O)C(C)NC(=O)C(Cc1c[nH]c2ccccc12)NC(=O)C(CCC(N)=O)NC(=O)CNC(=O)C(CO)NC(=O)CNC(=O)C(N)CCCCNC(=S)Nc1ccc2c(c1)C(=O)OC21c2ccc(O)cc2Oc2cc(O)ccc12)C(C)C)C(N)=O
InChI Key: InChIKey=WNKJOCMHOMPDLL-UHFFFAOYSA-N
Data: 1 IC50
Activity Spreadsheet -- Enzyme Inhibition Constant Data from BindingDB
Found 1 hit for monomerid = 50112620
Trg + Lig
Ki
nM
ΔG°
kcal/mole
IC50
nM
Kd
nM
EC50/IC50
nM
koff
s-1
kon
M-1s-1
pHTemp
°C
Gastrin-Releasing peptide
(RAT)
BDBM50112620
((epsilon-FITC-K-G-S-G-Q-W-A-V-G-H-L-M-NH2) | CHEMB...)
Show SMILES CSCCC(NC(=O)C(CC(C)C)NC(=O)C(Cc1cnc[nH]1)NC(=O)CNC(=O)C(NC(=O)C(C)NC(=O)C(Cc1c[nH]c2ccccc12)NC(=O)C(CCC(N)=O)NC(=O)CNC(=O)C(CO)NC(=O)CNC(=O)C(N)CCCCNC(=S)Nc1ccc2c(c1)C(=O)OC21c2ccc(O)cc2Oc2cc(O)ccc12)C(C)C)C(N)=O
Show InChI InChI=1S/C77H99N19O19S2/c1-38(2)25-55(72(110)93-53(66(80)104)22-24-117-6)94-73(111)57(28-43-32-81-37-87-43)91-63(102)35-86-74(112)65(39(3)4)96-67(105)40(5)88-71(109)56(26-41-31-83-52-13-8-7-11-46(41)52)95-70(108)54(20-21-61(79)100)90-62(101)34-85-69(107)58(36-97)92-64(103)33-84-68(106)51(78)12-9-10-23-82-76(116)89-42-14-17-48-47(27-42)75(113)115-77(48)49-18-15-44(98)29-59(49)114-60-30-45(99)16-19-50(60)77/h7-8,11,13-19,27,29-32,37-40,51,53-58,65,83,97-99H,9-10,12,20-26,28,33-36,78H2,1-6H3,(H2,79,100)(H2,80,104)(H,81,87)(H,84,106)(H,85,107)(H,86,112)(H,88,109)(H,90,101)(H,91,102)(H,92,103)(H,93,110)(H,94,111)(H,95,108)(H,96,105)(H2,82,89,116)
n/an/a 9.60n/an/an/an/an/an/a
Washington University School of Medicine
Curated by ChEMBL
Assay Description
In vitro binding affinity of [111In]-DTPA-[Y4]-bombesin to bombesin receptor in the rat pancreatic acinar cell line, AR42J
J Med Chem 45: 2003-15 (2002)
BindingDB Entry DOI: 10.7270/Q2CZ36GK