BDBM50112637 CHEMBL1299308
SMILES: Clc1ccccc1NC(=O)NCc1cccnc1
InChI Key: InChIKey=BYPMLXJTXCLBOI-UHFFFAOYSA-N
Data: 1 IC50
PDB links: 1 PDB ID matches this monomer.
Activity Spreadsheet -- Enzyme Inhibition Constant Data from BindingDB
Found 1 hit for monomerid = 50112637
Trg + Lig
Ki
nM
ΔG°
kcal/mole
IC50
nM
Kd
nM
EC50/IC50
nM
koff
s-1
kon
M-1s-1
pHTemp
°C
Epithelial discoidin domain-containing receptor 1
(Homo sapiens (Human))
BDBM50112637
(CHEMBL1299308)
Show SMILES Clc1ccccc1NC(=O)NCc1cccnc1
Show InChI InChI=1S/C13H12ClN3O/c14-11-5-1-2-6-12(11)17-13(18)16-9-10-4-3-7-15-8-10/h1-8H,9H2,(H2,16,17,18)
n/an/a>1.00E+5n/an/an/an/an/an/a
Astex Pharmaceuticals
Curated by ChEMBL
Assay Description
Inhibition of DDR1 (unknown origin) after 1 hr by time resolved fluorescence method
ACS Med Chem Lett 6: 798-803 (2015)
BindingDB Entry DOI: 10.7270/Q2SQ925G
3D
3D Structure (crystal)