null
SMILES: COc1cc(Nc2ncc(o2)-c2ccccc2N(C)C(=O)CCN2CCOCC2)ccc1-c1cnco1
InChI Key: InChIKey=HTKNYZVIKZSPAT-UHFFFAOYSA-N
Activity Spreadsheet -- Enzyme Inhibition Constant Data from BindingDB
Found 1 hit for monomerid = 50113215
Trg + Lig
Ki
nM
ΔG°
kcal/mole
IC50
nM
Kd
nM
EC50/IC50
nM
koff
s-1
kon
M-1s-1
pHTemp
°C
Inosine-5'-monophosphate dehydrogenase 2
(Homo sapiens (Human))
BDBM50113215
(CHEMBL67036 | N-{2-[2-(3-Methoxy-4-oxazol-5-yl-phe...)
Show SMILES COc1cc(Nc2ncc(o2)-c2ccccc2N(C)C(=O)CCN2CCOCC2)ccc1-c1cnco1
Show InChI InChI=1S/C27H29N5O5/c1-31(26(33)9-10-32-11-13-35-14-12-32)22-6-4-3-5-20(22)25-17-29-27(37-25)30-19-7-8-21(23(15-19)34-2)24-16-28-18-36-24/h3-8,15-18H,9-14H2,1-2H3,(H,29,30)
Reactome pathway
n/an/a 13n/an/an/an/an/an/a
TBA
Curated by ChEMBL
Assay Description
Inhibition of human inosine-5'-monophosphate dehydrogenase 2
J Med Chem 45: 2127-30 (2002)
BindingDB Entry DOI: 10.7270/Q21R6R71