null
SMILES: COc1cc(Nc2ncc(o2)-c2ccccc2N(C)C(=O)Cn2cncn2)ccc1-c1cnco1
InChI Key: InChIKey=VCWCPYKAUQCXAN-UHFFFAOYSA-N
Activity Spreadsheet -- Enzyme Inhibition Constant Data from BindingDB
Found 1 hit for monomerid = 50113233
Trg + Lig
Ki
nM
ΔG°
kcal/mole
IC50
nM
Kd
nM
EC50/IC50
nM
koff
s-1
kon
M-1s-1
pHTemp
°C
Inosine-5'-monophosphate dehydrogenase 2
(Homo sapiens (Human))
BDBM50113233
(CHEMBL66614 | N-{2-[2-(3-Methoxy-4-oxazol-5-yl-phe...)
Show SMILES COc1cc(Nc2ncc(o2)-c2ccccc2N(C)C(=O)Cn2cncn2)ccc1-c1cnco1
Show InChI InChI=1S/C24H21N7O4/c1-30(23(32)12-31-14-26-13-28-31)19-6-4-3-5-17(19)22-11-27-24(35-22)29-16-7-8-18(20(9-16)33-2)21-10-25-15-34-21/h3-11,13-15H,12H2,1-2H3,(H,27,29)
Reactome pathway
n/an/a 13n/an/an/an/an/an/a
TBA
Curated by ChEMBL
Assay Description
Inhibition of human inosine-5'-monophosphate dehydrogenase 2
J Med Chem 45: 2127-30 (2002)
BindingDB Entry DOI: 10.7270/Q21R6R71