null
SMILES: CN(C)CCN(C)CCNC(=O)c1cccn1S(=O)(=O)c1ccc(N[N-]C(=[SH+])NC(c2ccccc2)c2ccccc2)c(c1)[N+]([O-])=O
InChI Key: InChIKey=FYCIUTUSQDKBNG-UHFFFAOYSA-N
Activity Spreadsheet -- Enzyme Inhibition Constant Data from BindingDB
Found 1 hit for monomerid = 50113264
Trg + Lig
Ki
nM
ΔG°
kcal/mole
IC50
nM
Kd
nM
EC50/IC50
nM
koff
s-1
kon
M-1s-1
pHTemp
°C
B2 bradykinin receptor
(Homo sapiens (Human))
BDBM50113264
(1-[4-(4-benzhydrylthiosemicarbazido)-3-nitrobenzen...)
Show SMILES CN(C)CCN(C)CCNC(=O)c1cccn1S(=O)(=O)c1ccc(N[N-]C(=[SH+])NC(c2ccccc2)c2ccccc2)c(c1)[N+]([O-])=O
Show InChI InChI=1S/C32H38N8O5S2/c1-37(2)21-22-38(3)20-18-33-31(41)28-15-10-19-39(28)47(44,45)26-16-17-27(29(23-26)40(42)43)35-36-32(46)34-30(24-11-6-4-7-12-24)25-13-8-5-9-14-25/h4-17,19,23,30,35H,18,20-22H2,1-3H3,(H3,33,34,36,41,46)
237n/an/an/an/an/an/an/an/a
Novartis Institute for Medical Sciences
Curated by ChEMBL
Assay Description
Displacement of [3H]BK (1 nM) from human Bradykinin receptor B2 expressed in Cos-7 cells
J Med Chem 45: 2160-72 (2002)
BindingDB Entry DOI: 10.7270/Q2X067SG