null
SMILES: CN(C)CCC\C(C)=C\CC\C(C)=C\CC\C(C)=C\COP(O)(=O)OP(O)(O)=O
InChI Key: InChIKey=MQTYWKZQFYMNDN-WNWLUAIZSA-N
Activity Spreadsheet -- Enzyme Inhibition Constant Data from BindingDB
Found 1 hit for monomerid = 50113284
Trg + Lig
Ki
nM
ΔG°
kcal/mole
IC50
nM
Kd
nM
EC50/IC50
nM
koff
s-1
kon
M-1s-1
pHTemp
°C
Geranylgeranyl pyrophosphate synthase
(Homo sapiens (Human))
BDBM50113284
(14-dimethylamino-3,7,11-trimethyl-tetradeca-2,6,10...)
Show SMILES CN(C)CCC\C(C)=C\CC\C(C)=C\CC\C(C)=C\COP(O)(=O)OP(O)(O)=O
Show InChI InChI=1S/C19H37NO7P2/c1-17(9-6-11-18(2)13-8-15-20(4)5)10-7-12-19(3)14-16-26-29(24,25)27-28(21,22)23/h10-11,14H,6-9,12-13,15-16H2,1-5H3,(H,24,25)(H2,21,22,23)/b17-10+,18-11+,19-14+
Reactome pathway
n/an/a>1.00E+5n/an/an/an/an/an/a
University of Illinois at Urbana-Champaign
Curated by ChEMBL
Assay Description
Inhibitory activity against the human recombinant geranylgeranyl diphosphate synthase (GGPPSase).
J Med Chem 45: 2185-96 (2002)
BindingDB Entry DOI: 10.7270/Q2KH0MN1