BDBM50113442 CHEMBL3604485
SMILES: CC(C)(C)c1ccc(cc1)S(=O)(=O)Nc1ccc(Cl)cc1-c1ncncc1N
InChI Key: InChIKey=OEKSYTIEVKORHD-UHFFFAOYSA-N
Data: 1 IC50
Activity Spreadsheet -- Enzyme Inhibition Constant Data from BindingDB
Found 1 hit for monomerid = 50113442
Trg + Lig
Ki
nM
ΔG°
kcal/mole
IC50
nM
Kd
nM
EC50/IC50
nM
koff
s-1
kon
M-1s-1
pHTemp
°C
C-C chemokine receptor type 9
(Homo sapiens (Human))
BDBM50113442
(CHEMBL3604485)
Show SMILES CC(C)(C)c1ccc(cc1)S(=O)(=O)Nc1ccc(Cl)cc1-c1ncncc1N
Show InChI InChI=1S/C20H21ClN4O2S/c1-20(2,3)13-4-7-15(8-5-13)28(26,27)25-18-9-6-14(21)10-16(18)19-17(22)11-23-12-24-19/h4-12,25H,22H2,1-3H3
Reactome pathway
n/an/a 3.20n/an/an/an/an/an/a
Cubist Pharmaceuticals
Curated by ChEMBL
Assay Description
Antagonist activity at CCR9 receptor (unknown origin) assessed as inhibition of TECK-induced calcium mobilization incubated for 10 mins prior to TECK...
Bioorg Med Chem Lett 25: 3661-4 (2015)
BindingDB Entry DOI: 10.7270/Q2RR2123