BDBM50113478 CHEMBL3603925::US10246432, Example 20::US10584111, Ex No. 20
SMILES: Clc1ccc(nc1)-c1cc(ncn1)-c1cc(Cl)cc(c1)C#N
InChI Key: InChIKey=YEVYAOASVVGEDS-UHFFFAOYSA-N
Data: 3 KI  1 IC50
Activity Spreadsheet -- Enzyme Inhibition Constant Data from BindingDB
Found 4 hits for monomerid = 50113478
Trg + Lig
Ki
nM
ΔG°
kcal/mole
IC50
nM
Kd
nM
EC50/IC50
nM
koff
s-1
kon
M-1s-1
pHTemp
°C
Metabotropic glutamate receptor 5
(Homo sapiens (Human))
BDBM50113478
(CHEMBL3603925 | US10246432, Example 20 | US1058411...)
Show SMILES Clc1ccc(nc1)-c1cc(ncn1)-c1cc(Cl)cc(c1)C#N
Show InChI InChI=1S/C16H8Cl2N4/c17-12-1-2-14(20-8-12)16-6-15(21-9-22-16)11-3-10(7-19)4-13(18)5-11/h1-6,8-9H
1.60n/an/an/an/an/an/an/an/a
Heptares Therapeutics Ltd.
Curated by ChEMBL
Assay Description
Displacement of [3H]-M-MPEP from human mGlu5 receptor expressed in HEK293 cells after 90 mins by scintillation spectroscopy analysis
J Med Chem 58: 6653-64 (2015)
BindingDB Entry DOI: 10.7270/Q2H70HMZ
Metabotropic glutamate receptor 5
(Homo sapiens (Human))
BDBM50113478
(CHEMBL3603925 | US10246432, Example 20 | US1058411...)
Show SMILES Clc1ccc(nc1)-c1cc(ncn1)-c1cc(Cl)cc(c1)C#N
Show InChI InChI=1S/C16H8Cl2N4/c17-12-1-2-14(20-8-12)16-6-15(21-9-22-16)11-3-10(7-19)4-13(18)5-11/h1-6,8-9H
US Patent
1.70n/an/an/an/an/an/an/an/a
Heptares Therapeutics Limited
US Patent
Assay Description
Membrane PreparationcDNA encoding the human mGlu5 receptor was transfected into HEK293 cells using the transfection reagent Genejuice (Novagen). Fort...
US Patent US10584111 (2020)
BindingDB Entry DOI: 10.7270/Q2BR8VK9
Metabotropic glutamate receptor 5
(Homo sapiens (Human))
BDBM50113478
(CHEMBL3603925 | US10246432, Example 20 | US1058411...)
Show SMILES Clc1ccc(nc1)-c1cc(ncn1)-c1cc(Cl)cc(c1)C#N
Show InChI InChI=1S/C16H8Cl2N4/c17-12-1-2-14(20-8-12)16-6-15(21-9-22-16)11-3-10(7-19)4-13(18)5-11/h1-6,8-9H
US Patent
1.70n/an/an/an/an/an/an/an/a
Research Triangle Institute
Assay Description
After thawing, membrane homogenates were re-suspended in the binding buffer (50 mM HEPES pH 7.5, 150 mM NaCl) to a final assay concentration of 2.5 &...
J Med Chem 50: 3686-95 (2007)
BindingDB Entry DOI: 10.7270/Q2ZS2ZVS
Metabotropic glutamate receptor 5
(Homo sapiens (Human))
BDBM50113478
(CHEMBL3603925 | US10246432, Example 20 | US1058411...)
Show SMILES Clc1ccc(nc1)-c1cc(ncn1)-c1cc(Cl)cc(c1)C#N
Show InChI InChI=1S/C16H8Cl2N4/c17-12-1-2-14(20-8-12)16-6-15(21-9-22-16)11-3-10(7-19)4-13(18)5-11/h1-6,8-9H
n/an/a 3.20n/an/an/an/an/an/a
Heptares Therapeutics Ltd.
Curated by ChEMBL
Assay Description
Negative allosteric modulation at human mGlu5 receptor expressed in HEK293 cells assessed as inhibition of L-quisqualic acid-induced inositol phospha...
J Med Chem 58: 6653-64 (2015)
BindingDB Entry DOI: 10.7270/Q2H70HMZ