null
SMILES: CC(C)S(=O)(=O)c1nn(C)cc1Nc1nc(Nc2cc(C)c(CCN(C)C)cc2OC2CC2)ncc1Cl
InChI Key: InChIKey=ULBKRVUCPLAGRX-UHFFFAOYSA-N
Activity Spreadsheet -- Enzyme Inhibition Constant Data from BindingDB
Found 2 hits for monomerid = 50113514
Trg + Lig
Ki
nM
ΔG°
kcal/mole
IC50
nM
Kd
nM
EC50/IC50
nM
koff
s-1
kon
M-1s-1
pHTemp
°C
ALK tyrosine kinase receptor
(Homo sapiens (Human))
BDBM50113514
(CHEMBL3604652)
Show SMILES CC(C)S(=O)(=O)c1nn(C)cc1Nc1nc(Nc2cc(C)c(CCN(C)C)cc2OC2CC2)ncc1Cl
Show InChI InChI=1S/C25H34ClN7O3S/c1-15(2)37(34,35)24-21(14-33(6)31-24)28-23-19(26)13-27-25(30-23)29-20-11-16(3)17(9-10-32(4)5)12-22(20)36-18-7-8-18/h11-15,18H,7-10H2,1-6H3,(H2,27,28,29,30)
n/an/a 2n/an/an/an/an/an/a
Beijing Pearl Biotech Ltd
Curated by ChEMBL
Assay Description
Inhibition of wild type human recombinant ALK using TK substrate-biotin incubated for 30 mins by HTRF assay
Bioorg Med Chem Lett 25: 3738-43 (2015)
BindingDB Entry DOI: 10.7270/Q208674B
ALK tyrosine kinase receptor
(Homo sapiens (Human))
BDBM50113514
(CHEMBL3604652)
Show SMILES CC(C)S(=O)(=O)c1nn(C)cc1Nc1nc(Nc2cc(C)c(CCN(C)C)cc2OC2CC2)ncc1Cl
Show InChI InChI=1S/C25H34ClN7O3S/c1-15(2)37(34,35)24-21(14-33(6)31-24)28-23-19(26)13-27-25(30-23)29-20-11-16(3)17(9-10-32(4)5)12-22(20)36-18-7-8-18/h11-15,18H,7-10H2,1-6H3,(H2,27,28,29,30)
n/an/a 5n/an/an/an/an/an/a
Beijing Pearl Biotech Ltd
Curated by ChEMBL
Assay Description
Inhibition of ALK L1196M mutant (unknown origin) using TK substrate-biotin incubated for 30 mins by HTRF assay
Bioorg Med Chem Lett 25: 3738-43 (2015)
BindingDB Entry DOI: 10.7270/Q208674B