BDBM50113521 CHEMBL3604643
SMILES: CC(C)S(=O)(=O)c1nn(C)cc1Nc1nc(Nc2cc(Cl)c(cc2OC2CC2)C2CCN(C)CC2)ncc1Cl
InChI Key: InChIKey=OTBFHRYKQAVIFQ-UHFFFAOYSA-N
Data: 2 IC50
Activity Spreadsheet -- Enzyme Inhibition Constant Data from BindingDB
Found 2 hits for monomerid = 50113521
Trg + Lig
Ki
nM
ΔG°
kcal/mole
IC50
nM
Kd
nM
EC50/IC50
nM
koff
s-1
kon
M-1s-1
pHTemp
°C
ALK tyrosine kinase receptor
(Homo sapiens (Human))
BDBM50113521
(CHEMBL3604643)
Show SMILES CC(C)S(=O)(=O)c1nn(C)cc1Nc1nc(Nc2cc(Cl)c(cc2OC2CC2)C2CCN(C)CC2)ncc1Cl
Show InChI InChI=1S/C26H33Cl2N7O3S/c1-15(2)39(36,37)25-22(14-35(4)33-25)30-24-20(28)13-29-26(32-24)31-21-12-19(27)18(11-23(21)38-17-5-6-17)16-7-9-34(3)10-8-16/h11-17H,5-10H2,1-4H3,(H2,29,30,31,32)
n/an/a 4n/an/an/an/an/an/a
Beijing Pearl Biotech Ltd
Curated by ChEMBL
Assay Description
Inhibition of wild type human recombinant ALK using TK substrate-biotin incubated for 30 mins by HTRF assay
Bioorg Med Chem Lett 25: 3738-43 (2015)
BindingDB Entry DOI: 10.7270/Q208674B
ALK tyrosine kinase receptor
(Homo sapiens (Human))
BDBM50113521
(CHEMBL3604643)
Show SMILES CC(C)S(=O)(=O)c1nn(C)cc1Nc1nc(Nc2cc(Cl)c(cc2OC2CC2)C2CCN(C)CC2)ncc1Cl
Show InChI InChI=1S/C26H33Cl2N7O3S/c1-15(2)39(36,37)25-22(14-35(4)33-25)30-24-20(28)13-29-26(32-24)31-21-12-19(27)18(11-23(21)38-17-5-6-17)16-7-9-34(3)10-8-16/h11-17H,5-10H2,1-4H3,(H2,29,30,31,32)
n/an/a 10n/an/an/an/an/an/a
Beijing Pearl Biotech Ltd
Curated by ChEMBL
Assay Description
Inhibition of ALK L1196M mutant (unknown origin) using TK substrate-biotin incubated for 30 mins by HTRF assay
Bioorg Med Chem Lett 25: 3738-43 (2015)
BindingDB Entry DOI: 10.7270/Q208674B