BDBM50113705 2-[[6-(3-Chloro-phenylamino)-9-isopropyl-9H-purin-2-yl]-(4-methyl-benzyl)-amino]-3-methyl-butan-1-ol::CHEMBL80203
SMILES: CC(C)[C@H](CO)N(Cc1ccc(C)cc1)c1nc(Nc2cccc(Cl)c2)c2ncn(C(C)C)c2n1
InChI Key: InChIKey=WEKBAZPWRGZXJG-QHCPKHFHSA-N
Data: 1 IC50
Activity Spreadsheet -- Enzyme Inhibition Constant Data from BindingDB
Found 1 hit for monomerid = 50113705
Trg + Lig
Ki
nM
ΔG°
kcal/mole
IC50
nM
Kd
nM
EC50/IC50
nM
koff
s-1
kon
M-1s-1
pHTemp
°C
Cyclin-dependent kinase 1
(Homo sapiens (Human))
BDBM50113705
(2-[[6-(3-Chloro-phenylamino)-9-isopropyl-9H-purin-...)
Show SMILES CC(C)[C@H](CO)N(Cc1ccc(C)cc1)c1nc(Nc2cccc(Cl)c2)c2ncn(C(C)C)c2n1
Show InChI InChI=1S/C27H33ClN6O/c1-17(2)23(15-35)33(14-20-11-9-19(5)10-12-20)27-31-25(30-22-8-6-7-21(28)13-22)24-26(32-27)34(16-29-24)18(3)4/h6-13,16-18,23,35H,14-15H2,1-5H3,(H,30,31,32)/t23-/m0/s1
Reactome pathway
n/an/a 1.00E+7n/an/an/an/an/an/a
Aventis Pharma Deutschland GmbH
Curated by ChEMBL
Assay Description
Binding affinity to cyclin-dependent kinase 1 (CDK1)
J Med Chem 45: 2366-78 (2002)
BindingDB Entry DOI: 10.7270/Q25B01SB