BDBM50113717 2-[6-(3-Chloro-phenylamino)-9-isopropyl-9H-purin-2-ylamino]-3-cyclohexyl-propan-1-ol::CHEMBL311488
SMILES: CC(C)n1cnc2c(Nc3cccc(Cl)c3)nc(N[C@H](CO)CC3CCCCC3)nc12
InChI Key: InChIKey=ZPORIYZCSVTKKP-IBGZPJMESA-N
Data: 1 IC50
Activity Spreadsheet -- Enzyme Inhibition Constant Data from BindingDB
Found 1 hit for monomerid = 50113717
Trg + Lig
Ki
nM
ΔG°
kcal/mole
IC50
nM
Kd
nM
EC50/IC50
nM
koff
s-1
kon
M-1s-1
pHTemp
°C
Cyclin-dependent kinase 1
(Homo sapiens (Human))
BDBM50113717
(2-[6-(3-Chloro-phenylamino)-9-isopropyl-9H-purin-2...)
Show SMILES CC(C)n1cnc2c(Nc3cccc(Cl)c3)nc(N[C@H](CO)CC3CCCCC3)nc12
Show InChI InChI=1S/C23H31ClN6O/c1-15(2)30-14-25-20-21(26-18-10-6-9-17(24)12-18)28-23(29-22(20)30)27-19(13-31)11-16-7-4-3-5-8-16/h6,9-10,12,14-16,19,31H,3-5,7-8,11,13H2,1-2H3,(H2,26,27,28,29)/t19-/m0/s1
Reactome pathway
n/an/a 5.00E+6n/an/an/an/an/an/a
Aventis Pharma Deutschland GmbH
Curated by ChEMBL
Assay Description
Binding affinity to cyclin-dependent kinase 1 (CDK1)
J Med Chem 45: 2366-78 (2002)
BindingDB Entry DOI: 10.7270/Q25B01SB