BDBM50113729 2-[[6-(3-Chloro-phenylamino)-9-isopropyl-9H-purin-2-yl]-(2-hydroxy-ethyl)-amino]-ethanol::CHEMBL77610
SMILES: CC(C)n1cnc2c(Nc3cccc(Cl)c3)nc(nc12)N(CCO)CCO
InChI Key: InChIKey=GUDQVRWWXUKBCC-UHFFFAOYSA-N
Data: 1 IC50
Activity Spreadsheet -- Enzyme Inhibition Constant Data from BindingDB
Found 1 hit for monomerid = 50113729
Trg + Lig
Ki
nM
ΔG°
kcal/mole
IC50
nM
Kd
nM
EC50/IC50
nM
koff
s-1
kon
M-1s-1
pHTemp
°C
Cyclin-dependent kinase 1
(Homo sapiens (Human))
BDBM50113729
(2-[[6-(3-Chloro-phenylamino)-9-isopropyl-9H-purin-...)
Show SMILES CC(C)n1cnc2c(Nc3cccc(Cl)c3)nc(nc12)N(CCO)CCO
Show InChI InChI=1S/C18H23ClN6O2/c1-12(2)25-11-20-15-16(21-14-5-3-4-13(19)10-14)22-18(23-17(15)25)24(6-8-26)7-9-27/h3-5,10-12,26-27H,6-9H2,1-2H3,(H,21,22,23)
Reactome pathway
n/an/a 2.20E+5n/an/an/an/an/an/a
Aventis Pharma Deutschland GmbH
Curated by ChEMBL
Assay Description
Binding affinity to cyclin-dependent kinase 1 (CDK1)
J Med Chem 45: 2366-78 (2002)
BindingDB Entry DOI: 10.7270/Q25B01SB